program: Orca
programVersion: 5.0.3
elementType: Cl Cl Cl O O C C C C C C C C C C C C C C C C H H H H H H H H H H H H H H H
charge: 0
multiplicity: 1
keywords: wb97x-d3
keywords: def2-TZVPP
keywords: def2/J RIJCOSX
keywords: DEFGRID2
keywords: scfconv7
keywords: smallprint printgap noloewdin
keywords: NOSOSCF
formula: C16H15Cl3O2
InChI: InChI=1/C16H15Cl3O2/c1-20-13-7-3-11(4-8-13)15(16(17,18)19)12-5-9-14(21-2)10-6-12/h3-10,15H,1-2H3
36 atoms
Cl -1.531797 -2.867134 0.470502
Cl -0.073559 -1.920319 -1.808435
Cl 1.337597 -2.965965 0.455306
O  -4.729611 2.512604 0.267993
O  4.899531 2.167034 0.199268
C  -0.017983 -0.624488 0.654616
C  -1.267207 0.208303 0.453499
C  1.282764 0.119743 0.437269
C  -0.068254 -1.999511 -0.039175
C  -1.649504 0.788128 -0.750593
C  1.679751 0.685167 -0.768701
C  -2.080706 0.438582 1.563861
C  2.134567 0.275931 1.531634
C  -2.800556 1.559531 -0.85381
C  2.881044 1.373051 -0.889443
C  -3.222912 1.210266 1.483487
C  3.32763 0.964179 1.433969
C  -3.597927 1.7762 0.265891
C  3.716506 1.516434 0.214384
C  -5.147748 3.10429 -0.948496
C  5.333734 2.743858 -1.018704
H  -0.021819 -0.903036 1.712184
H  -1.063473 0.660136 -1.648477
H  1.065895 0.610938 -1.654045
H  -1.812773 0.008358 2.521079
H  1.856752 -0.146248 2.489692
H  -3.05161 1.983826 -1.816177
H  3.141007 1.789757 -1.85275
H  -3.830679 1.375104 2.364037
H  3.964784 1.073658 2.302295
H  -4.410123 3.812776 -1.333048
H  -6.066485 3.643035 -0.729064
H  -5.356162 2.355449 -1.716523
H  5.471745 1.992781 -1.800371
H  6.293107 3.212484 -0.8127
H  4.641267 3.50863 -1.378511
elementType: Cl O C H
totalener: -2149.85212209 hartree
nucrepener: 2097.71337113 hartree
electener: -4247.56549322 hartree
oneelecener: -7126.11529395 hartree
twoeener: 2878.54980073 hartree
cpcmener: -0.02561145 hartree
kineticenergy: 2144.51872074 hartree
xcener: -138.569300799924 hartree
chargesum: 0.0000000
charge: -0.058468 -0.054807 -0.058267 -0.339316 -0.339376 0.042797 0.023930 0.026198 0.125137 -0.238289 -0.239910 -0.135749 -0.136410 -0.240649 -0.241011 -0.228640 -0.228887 0.315909 0.316204 -0.118074 -0.117905 0.109175 0.140114 0.140138 0.137069 0.137154 0.142218 0.142925 0.139722 0.139686 0.112375 0.123612 0.112780 0.112531 0.123818 0.112264
qa: -0.0585 -0.0548 -0.0583 -0.3393 -0.3394 0.0428 0.0239 0.0262 0.1251 -0.2383 -0.2399 -0.1357 -0.1364 -0.2406 -0.2410 -0.2286 -0.2289 0.3159 0.3162 -0.1181 -0.1179 0.1092 0.1401 0.1401 0.1371 0.1372 0.1422 0.1429 0.1397 0.1397 0.1124 0.1236 0.1128 0.1125 0.1238 0.1123
va: 1.2441 1.2500 1.2441 2.0575 2.0575 3.7052 3.5244 3.5239 4.4921 4.0602 4.0601 3.9869 3.9871 3.9679 3.9672 3.9937 3.9937 3.7706 3.7702 3.8584 3.8584 1.0546 1.0160 1.0153 1.0038 1.0040 1.0129 1.0126 1.0107 1.0108 0.9873 0.9938 0.9872 0.9873 0.9938 0.9873
dispcorr: -0.018675399 hartree
energy: -2149.870797491837
dipole: 1.12970 -1.09091 0.03880 34.05519 -32.52667 1.52853 -2.13053 1.11018 -1.02034
magnitude: 1.83820 au
magnitude: 4.67234 debye
