program: Orca
programVersion: 5.0.2
elementType: S O O O O C C C C C C C C C C C C C C C C C C C C C C C H H H H H H H H H H H H H H H H H H H H H H H H
charge: 0
multiplicity: 1
keywords: wb97x-d3
keywords: def2-TZVPP
keywords: def2/J RIJCOSX
keywords: DEFGRID2
keywords: scfconv7
keywords: smallprint printgap noloewdin
keywords: NOSOSCF
formula: C23H24O4S
InChI: InChI=1/C23H24O4S/c1-23(2)19(12-17-8-9-28-22(17)25)20(23)21(24)27-14-16-11-18(26-13-16)10-15-6-4-3-5-7-15/h3-7,11-13,19-20H,8-10,14H2,1-2H3
52 atoms
S  -0.798382 -2.87458 1.095728
O  2.418411 1.573083 0.125602
O  2.287728 1.818662 -2.090857
O  0.660942 -1.400871 2.702487
O  -1.777799 0.69241 1.210339
C  4.906147 -0.087227 -0.24605
C  3.752978 -1.0255 -0.345632
C  3.795649 0.227623 -1.229412
C  5.152776 0.740981 0.99175
C  6.192946 -0.532322 -0.903266
C  2.730012 -1.176284 0.706694
C  2.772365 1.283424 -1.115979
C  1.548924 -1.764276 0.49294
C  1.022428 -2.280021 -0.806945
C  0.575478 -1.885826 1.596177
C  -0.072362 -3.307781 -0.515391
C  1.306709 2.457049 0.356022
C  0.035555 1.69014 0.406226
C  -0.654839 1.036066 -0.668041
C  -0.693268 1.43811 1.517559
C  -1.742307 0.444024 -0.123731
C  -2.863004 -0.335245 -0.707641
C  -4.146075 0.459708 -0.730891
C  -5.012084 0.448411 0.358871
C  -4.46279 1.249011 -1.832926
C  -6.17271 1.211109 0.346919
C  -5.6239 2.009395 -1.849442
C  -6.481962 1.994108 -0.75747
H  3.919778 -1.931074 -0.923016
H  4.038302 0.032798 -2.267144
H  4.265866 0.956275 1.58044
H  5.851545 0.210162 1.641118
H  5.614492 1.693278 0.725613
H  6.785513 -1.132872 -0.211199
H  6.010028 -1.133594 -1.794431
H  6.795385 0.328387 -1.198472
H  2.957854 -0.814363 1.703769
H  1.801594 -2.73125 -1.4218
H  0.604282 -1.447222 -1.378804
H  0.331954 -4.31639 -0.449993
H  -0.8563 -3.297984 -1.269047
H  1.508054 2.92193 1.319313
H  1.281938 3.243195 -0.398296
H  -0.380815 1.011744 -1.710611
H  -0.569068 1.718121 2.552127
H  -2.577977 -0.618178 -1.721543
H  -3.004486 -1.261212 -0.14421
H  -4.782077 -0.166146 1.22128
H  -3.795998 1.265311 -2.687119
H  -6.837554 1.191491 1.200884
H  -5.859624 2.613104 -2.716412
H  -7.387741 2.5863 -0.768747
elementType: S O C H
totalener: -1590.09343492 hartree
nucrepener: 2825.92482199 hartree
electener: -4416.01825691 hartree
oneelecener: -7792.71734048 hartree
twoeener: 3376.69908358 hartree
cpcmener: -0.04623295 hartree
kineticenergy: 1584.22160349 hartree
xcener: -135.012856859179 hartree
chargesum: -0.0000000
charge: -0.070073 -0.263117 -0.503785 -0.461824 -0.285158 0.120804 -0.072021 -0.105381 -0.277698 -0.265096 -0.044780 0.432996 -0.154655 -0.123227 0.307942 -0.126897 0.051239 -0.048413 -0.331452 -0.045936 0.199288 -0.041163 0.059223 -0.211996 -0.205220 -0.162657 -0.160422 -0.172556 0.120022 0.094209 0.089004 0.098094 0.106099 0.095543 0.089475 0.098855 0.130062 0.107792 0.112660 0.130368 0.121100 0.113860 0.125342 0.160757 0.178057 0.113984 0.110497 0.142079 0.143732 0.159418 0.160125 0.160903
qa: -0.0701 -0.2631 -0.5038 -0.4618 -0.2852 0.1208 -0.0720 -0.1054 -0.2777 -0.2651 -0.0448 0.4330 -0.1547 -0.1232 0.3079 -0.1269 0.0512 -0.0484 -0.3315 -0.0459 0.1993 -0.0412 0.0592 -0.2120 -0.2052 -0.1627 -0.1604 -0.1726 0.1200 0.0942 0.0890 0.0981 0.1061 0.0955 0.0895 0.0989 0.1301 0.1078 0.1127 0.1304 0.1211 0.1139 0.1253 0.1608 0.1781 0.1140 0.1105 0.1421 0.1437 0.1594 0.1601 0.1609
va: 2.4345 2.1185 1.9893 2.0155 2.2458 3.7900 3.8446 3.8816 3.8938 3.9011 3.7480 4.0975 3.5831 3.9546 4.1211 3.9538 3.8577 3.5917 3.9698 3.9274 3.5865 3.7633 3.5850 3.9555 3.9431 3.8972 3.8952 3.8910 1.0053 1.0292 1.0138 1.0002 0.9999 1.0023 1.0048 1.0013 1.0219 1.0089 1.0111 1.0053 1.0051 1.0016 1.0077 1.0205 0.9947 1.0100 1.0179 1.0089 1.0041 0.9904 0.9901 0.9895
dispcorr: -0.031498197 hartree
energy: -1590.124933116957
dipole: 14.93195 -13.55849 1.37346 0.80102 -1.86071 -1.05969 -8.34678 6.79730 -1.54948
magnitude: 2.32599 au
magnitude: 5.91219 debye
