program: Gaussian 09
title: 000074834
version: EM64L-G09RevD.01
frameworkgroup: C1[X(C6H7ClN2O2S)]
method: RPBEPBE
basis: SDD
operation: Freq
keyword: #p
keyword: freq=noraman
keyword: PBEPBE/SDD
title: #p freq=noraman PBEPBE/SDD
converged: YES YES NO NO
title: Mulliken charges:
elementType: Cl S O O N N C C C C C C H H H H H H H
charge: -0.029163 0.931991 -0.549836 -0.508029 -0.709069 -0.696539 0.109597 -0.463859 -0.163658 0.558809 -0.163339 -0.419791 0.301154 0.257468 0.231316 0.343806 0.329612 0.315808 0.323723
chargesum: 0.00000
title: Mulliken charges with hydrogens summed into heavy atoms:
elementType: Cl S O O N N C C C C C C
charge: -0.029163 0.931991 -0.549836 -0.508029 -0.035651 -0.057009 0.109597 -0.162706 -0.163658 0.558809 0.094129 -0.188475
polarizability: 1.59333198e+02 1.25936807e+01 1.32772702e+02 1.15535175e+00 -1.61856876e+00 6.92259835e+01
1716.lowfreq: -5.2409 0.0014 0.0014 0.0030 6.1364 8.1161 56.9310 96.3163 117.2561
frequency: 56.9286 96.3098 117.2481 128.4069 153.2058 198.5254 221.1674 248.0734 268.4705 303.1180 318.2422 331.9300 364.2038 380.3274 422.6746 427.2453 443.5551 454.5622 472.5031 595.4409 623.2647 658.2961 702.4629 782.3392 813.2621 815.1406 855.1691 901.8882 927.8513 945.3529 979.3719 1032.3738 1071.2587 1107.3396 1146.8815 1242.5216 1318.0848 1375.8984 1430.6055 1482.0413 1525.9812 1564.7024 1625.6662 1648.6991 3132.9665 3138.3216 3169.6216 3370.6729 3541.6567 3566.2152 3705.3710
redmass: 7.5516 4.8521 4.0559 7.8797 1.8327 8.0050 4.8973 3.3116 4.6695 5.1540 5.2905 7.0707 9.3184 1.0735 6.8435 1.2582 3.3671 3.5267 3.6542 4.5793 7.1819 6.8848 2.9645 1.8280 5.4634 1.5722 5.8905 1.5688 5.2188 1.3661 4.1548 1.4652 1.4845 2.0931 1.2972 1.4020 2.4003 3.9894 4.2835 3.7907 1.0915 7.4211 4.1472 1.2949 1.0913 1.0895 1.0958 1.0411 1.1008 1.0454 1.1042
irintensity: 3.8661 0.8368 9.8706 2.9230 20.9402 3.9948 12.0191 8.0387 1.5323 3.5653 5.9743 3.9629 13.0055 25.6621 47.1377 263.6917 103.7306 1.9971 131.3970 0.3488 20.7207 3.8732 3.4820 142.5480 28.9208 61.8170 5.5158 37.6089 82.2380 0.1050 7.8921 0.2175 9.9406 46.4926 18.5189 0.8941 32.8954 8.3722 3.2724 189.9781 35.2028 9.7593 62.0339 252.1994 10.3072 16.4333 5.5099 25.0310 26.3485 98.5492 27.3910
temp: 298.150 k
press: 1.00000 atm
elementType: 17 16 8 8 7 7 6 6 6 6 6 6 1 1 1 1 1 1 1
symmnumber: 1
zpe: 336171.1 jmol-1
zpe.correction: 0.128041 hartree
zpe.thermalcorrener: 0.140916 hartree
zpe.thermalcorrenthalpy: 0.141860 hartree
zpe.thermalcorrgfe: 0.089027 hartree
zpe.sumelectzpe: -1349.834786 hartree
zpe.sumelectthermal: -1349.821911 hartree
zpe.sumelectthermalent: -1349.820967 hartree
zpe.sumelectthermalfe: -1349.873800 hartree
dipole: -5.4003 0.7442 2.4978
dipole: 5.9964
quadrupole: -60.1064 -84.6970 -92.4147
quadrupole: 6.7216 9.8122 -1.2927
quadrupole: 18.9663 -5.6243 -13.3420 6.7216 9.8122 -1.2927
hfenergy: -1349.9628267 hartree
pointgroup: C01 [X(C6H7Cl1N2O2S1)]
dipole: -2.1954645 -0.1093974 -0.8564829 debye
dipolederiv: -0.3751077 0.3087869 0.075209 0.2338642 -0.4009968 -0.0590506 0.085104 -0.0833127 -0.0377622 1.8913166 0.2816494 -0.1777327 0.2270287 1.3086704 0.0047085 -0.1091945 -0.012585 1.5597384 -0.6500735 -0.0810035 0.0390771 -0.0674766 -0.6834471 -0.0596201 0.0093341 0.0632508 -0.4954219 -0.7182985 -0.0545816 -0.0895347 -0.0320525 -0.4972348 0.1345828 -0.053736 0.0107702 -0.654013 -0.6950505 -0.0308781 0.1175349 -0.0454308 -0.3860512 -0.0738851 0.1501392 -0.0104613 -0.8457075 -1.0491429 0.6977273 0.1026919 0.7838226 -0.7055832 -0.0376084 0.0992105 -0.0243151 -0.7412886 -0.0866573 -0.0290956 -0.0267645 -0.0379159 0.0434481 0.0268421 -0.086852 -0.0082262 -0.1040319 -0.482288 0.4424149 0.0644824 -0.2742293 -0.1999758 0.0127482 -0.008666 -0.0363789 -0.1726631 0.1160227 -0.6847876 -0.1019263 -0.2091143 0.364915 0.0865799 -0.0729182 0.123619 -0.0832692 1.0602928 -0.8938757 -0.1527771 -0.8791647 0.6456939 0.1010458 -0.126502 0.0977035 0.1875393 0.1590233 0.2019844 0.0150963 -0.1123117 -0.0391994 0.0070743 -0.0095647 -0.0148038 -0.0507637 -0.0340466 -0.0022782 -0.0037511 0.4690897 -0.1911431 -0.0210943 0.0435672 0.0041298 -0.2222886 0.1573608 0.0141013 -0.004019 0.0447266 0.0476622 -0.0199458 -0.0087198 -0.0110781 0.1685456 0.0705719 -0.0327944 0.0006076 -0.0373431 -0.0322608 -0.0224123 -0.0002187 -0.0244984 0.1574368 -0.1190285 -0.0429911 0.0096971 -0.0234024 0.0667055 -0.0117939 0.0092414 -0.009515 0.1679626 0.1449447 -0.0709796 0.0837279 -0.0087523 0.1485298 -0.0971426 0.0359001 -0.0551243 0.240911 0.2292137 0.0792727 0.04263 0.0797272 0.1553106 0.0729498 0.0352328 0.037443 0.1510126 0.2204074 -0.0612466 0.0005289 -0.0246761 0.1420719 -0.0277786 0.0060921 -0.0265781 0.3871085 0.1605398 -0.0414248 0.0052224 -0.0863894 0.212885 -0.0161998 0.0025505 -0.0200395 0.3869549 unknown
polarizability: 157.6799979|-12.865429|133.2335693|-8.571817|6.4074271|70.4183157 unknown
InChI: InChI=1S/C6H7ClN2O2S/c7-5-2-1-4(8)3-6(5)12(9,10)11/h1-3H,8-9H2
charge 0 multiplicity 1
19 atoms
Cl 1.213686 -2.460765 -0.44619
S  1.86925 0.860829 0.022527
O  1.687234 2.478859 0.051063
O  2.755253 0.116658 1.159549
N  2.487253 0.49295 -1.662049
N  -3.29923 1.527041 0.265343
C  0.119242 0.120248 -0.046625
C  -0.905919 1.060401 0.103899
C  -0.123992 -1.252499 -0.202706
C  -2.259993 0.616746 0.113639
C  -1.462265 -1.697366 -0.197366
C  -2.516428 -0.778963 -0.036813
H  -0.638651 2.118746 0.20911
H  -1.674992 -2.763376 -0.321854
H  -3.548945 -1.14605 -0.031751
H  3.08556 1.280966 -1.960008
H  2.963054 -0.423671 -1.665484
H  -4.266684 1.217827 0.277242
H  -3.111533 2.519318 0.376075
