program: Orca
programVersion: 5.0.2
elementType: S O O O O C C C C C C C C C C C C C C C C C C C C C C C H H H H H H H H H H H H H H H H H H H H H H H H
charge: 0
multiplicity: 1
keywords: wb97x-d3
keywords: def2-TZVPP
keywords: def2/J RIJCOSX
keywords: DEFGRID2
keywords: scfconv7
keywords: smallprint printgap noloewdin
keywords: NOSOSCF
formula: C23H24O4S
InChI: InChI=1/C23H24O4S/c1-23(2)19(12-17-8-9-28-22(17)25)20(23)21(24)27-14-16-11-18(26-13-16)10-15-6-4-3-5-7-15/h3-7,11-13,19-20H,8-10,14H2,1-2H3
52 atoms
S  -1.66602 -3.076021 -0.932594
O  2.663293 2.566484 -0.293457
O  2.052421 1.120284 1.298157
O  -0.324446 -2.989471 1.324632
O  -1.801653 3.185901 0.499185
C  4.293294 -0.697434 0.066275
C  3.022634 -1.047777 -0.642089
C  3.459038 0.417507 -0.518373
C  4.432823 -0.880555 1.556275
C  5.574347 -0.983357 -0.681195
C  1.844672 -1.582539 0.052502
C  2.659905 1.362473 0.280952
C  0.750455 -2.005073 -0.59209
C  0.4862 -1.937029 -2.063868
C  -0.330297 -2.684234 0.152407
C  -1.024368 -2.02488 -2.269074
C  1.836071 3.590403 0.264024
C  0.388584 3.257639 0.135355
C  -0.220999 2.409197 -0.844733
C  -0.618517 3.695183 0.92299
C  -1.545814 2.391635 -0.569374
C  -2.675946 1.615938 -1.131389
C  -3.26506 0.627346 -0.147976
C  -4.602928 0.256559 -0.260332
C  -2.497613 0.053372 0.862523
C  -5.162406 -0.663229 0.615644
C  -3.058989 -0.855728 1.748887
C  -4.393245 -1.217238 1.630315
H  3.137861 -1.411611 -1.657824
H  3.84051 0.841159 -1.439344
H  4.756204 -1.900923 1.767845
H  5.199147 -0.207124 1.943054
H  3.524198 -0.69882 2.122819
H  6.373285 -0.318634 -0.348865
H  5.897902 -2.009919 -0.501279
H  5.455961 -0.853564 -1.757306
H  1.88349 -1.697689 1.129587
H  0.973886 -2.774458 -2.569944
H  0.869767 -1.018665 -2.508492
H  -1.28837 -2.463433 -3.228353
H  -1.4963 -1.046165 -2.192985
H  2.105027 3.786113 1.304081
H  2.089893 4.478308 -0.314384
H  0.265368 1.85563 -1.633477
H  -0.647362 4.347057 1.781995
H  -3.465489 2.28324 -1.487995
H  -2.306437 1.086968 -2.013409
H  -5.214754 0.696074 -1.039572
H  -1.449806 0.312352 0.967047
H  -6.204063 -0.938646 0.511476
H  -2.449393 -1.283632 2.534042
H  -4.830859 -1.925293 2.32199
elementType: S O C H
totalener: -1590.09474749 hartree
nucrepener: 2852.00889937 hartree
electener: -4442.10364686 hartree
oneelecener: -7845.43466839 hartree
twoeener: 3403.33102153 hartree
cpcmener: -0.05136477 hartree
kineticenergy: 1584.20620755 hartree
xcener: -135.011594345053 hartree
chargesum: 0.0000000
charge: -0.061203 -0.293431 -0.484703 -0.465873 -0.289951 0.113489 -0.034991 -0.046053 -0.285903 -0.256201 -0.089705 0.396796 -0.151249 -0.139823 0.302805 -0.108247 0.105727 -0.053880 -0.338089 -0.058512 0.222012 -0.068126 0.043807 -0.193956 -0.183912 -0.156264 -0.177773 -0.178002 0.119318 0.099397 0.103793 0.103669 0.093361 0.097693 0.096574 0.090630 0.123896 0.112831 0.095759 0.130119 0.100968 0.123085 0.119082 0.164267 0.177844 0.116719 0.116792 0.141791 0.127997 0.160023 0.155631 0.159971
qa: -0.0612 -0.2934 -0.4847 -0.4659 -0.2900 0.1135 -0.0350 -0.0461 -0.2859 -0.2562 -0.0897 0.3968 -0.1512 -0.1398 0.3028 -0.1082 0.1057 -0.0539 -0.3381 -0.0585 0.2220 -0.0681 0.0438 -0.1940 -0.1839 -0.1563 -0.1778 -0.1780 0.1193 0.0994 0.1038 0.1037 0.0934 0.0977 0.0966 0.0906 0.1239 0.1128 0.0958 0.1301 0.1010 0.1231 0.1191 0.1643 0.1778 0.1167 0.1168 0.1418 0.1280 0.1600 0.1556 0.1600
va: 2.4290 2.1246 1.9935 2.0139 2.2598 3.8088 3.8133 3.8676 3.8938 3.8898 3.7848 4.0740 3.6079 3.9915 4.1592 3.9376 3.8182 3.6378 3.9779 3.9476 3.5998 3.8433 3.5611 3.9450 3.8363 3.8860 3.8618 3.8991 1.0032 1.0303 0.9992 0.9989 1.0188 1.0020 1.0024 1.0045 1.0305 1.0034 1.0063 1.0098 1.0182 1.0040 0.9885 1.0086 0.9932 1.0079 0.9935 1.0019 1.0131 0.9891 1.0008 0.9892
dispcorr: -0.031473976 hartree
energy: -1590.126221465184
dipole: 16.20242 -14.28164 1.92078 -0.65361 1.98637 1.33276 -5.38360 2.04335 -3.34025
magnitude: 4.07712 au
magnitude: 10.36322 debye
