program: Gaussian 09
title: 000074845
version: EM64L-G09RevD.01
frameworkgroup: C1[X(C12H11NO2)]
method: RPBEPBE
basis: SDD
operation: Freq
keyword: #p
keyword: freq=noraman
keyword: PBEPBE/SDD
title: #p freq=noraman PBEPBE/SDD
converged: YES YES NO NO
title: Mulliken charges:
elementType: O O N C C C C C C C C C C C C H H H H H H H H H H H
charge: -0.260410 -0.255587 -0.032192 0.459220 -0.312184 -0.329728 -0.389626 0.111648 -0.229292 -0.241851 -0.236707 -0.225074 0.199945 -0.668221 -0.211016 0.263508 0.260956 0.238455 0.232290 0.231652 0.237953 0.236498 0.237582 0.211207 0.235758 0.235214
chargesum: 0.00000
title: Mulliken charges with hydrogens summed into heavy atoms:
elementType: O O N C C C C C C C C C C C C
charge: -0.260410 -0.255587 -0.032192 0.459220 -0.048676 -0.068771 -0.151171 0.111648 0.234650 -0.003897 -0.000209 0.012509 0.199945 0.013958 -0.211016
polarizability: 2.62089016e+02 9.50113498e+00 1.49813389e+02 -3.55483806e-01 -1.64640525e-01 6.48976037e+01
1716.lowfreq: -26.6886 -6.7044 -0.0004 0.0005 0.0008 6.0077 15.5645 47.5716 54.0127
frequency: -19.6435 47.4169 53.8085 70.3727 89.6423 126.9563 131.7647 185.1958 219.3668 230.4298 265.9433 296.3641 328.8492 357.4564 404.2279 416.1302 488.9165 515.4544 575.4854 594.1712 611.9931 693.4197 728.4782 731.3057 779.1382 779.9593 796.2438 801.4961 853.0619 879.9444 934.7936 984.7509 987.8952 996.3217 1008.6488 1018.0930 1027.8384 1069.1071 1095.0294 1113.7873 1135.1240 1176.8928 1188.6863 1204.3248 1247.9095 1254.2700 1331.9701 1355.1534 1369.9297 1395.5726 1400.3431 1440.6239 1462.0788 1471.9842 1484.4617 1485.4845 1575.5475 1585.9680 1609.5396 1623.1904 2163.5108 2997.9447 3010.3528 3070.3630 3094.8437 3096.9842 3111.3042 3127.2620 3137.5285 3151.9346 3167.1324 3186.1904
redmass: 2.6590 4.5356 3.6487 4.3418 6.7365 2.7574 8.6969 5.2641 6.1989 1.6269 2.7459 5.5616 4.0654 4.1562 2.8100 6.5885 3.5558 10.9523 6.8501 5.8629 6.4513 1.6977 7.1437 8.0658 1.8552 5.9437 1.1100 4.1883 1.2573 4.6868 1.3667 1.4116 6.1199 1.4335 1.3548 2.3611 2.2531 5.0840 1.7247 2.2570 1.4660 1.1166 2.2241 1.2160 1.1351 3.2187 1.5321 1.3973 2.0128 3.4104 1.2725 2.2728 1.0397 1.0639 1.9797 1.1288 5.7275 8.3355 5.9211 8.7695 12.6191 1.0360 1.0579 1.1069 1.0985 1.0879 1.1025 1.0873 1.0883 1.0934 1.0991 1.0957
irintensity: 0.6397 1.4793 1.9992 1.7393 0.9411 1.3073 1.9682 4.3741 0.1522 1.2632 6.0188 10.6023 0.0126 9.5261 0.0062 0.2347 13.4156 1.1947 22.9913 1.6525 0.0281 60.4212 6.2548 0.3608 49.4099 4.9317 2.9171 2.5169 0.0475 24.2562 0.4903 4.5909 4.6594 10.2115 1.2343 50.7363 4.6862 185.2703 38.3657 11.0242 6.2625 45.8544 533.9585 32.9451 0.0374 82.8134 11.5796 2.9322 1.5602 7.7081 25.5221 23.2909 12.5542 6.1248 11.3684 18.3466 34.4250 263.3498 1.9206 137.3021 17.6684 20.7780 19.4325 9.0703 28.6768 0.1164 38.5893 2.8778 1.1415 20.5624 26.3944 9.1536
temp: 298.150 k
press: 1.00000 atm
elementType: 8 8 7 6 6 6 6 6 6 6 6 6 6 6 6 1 1 1 1 1 1 1 1 1 1 1
symmnumber: 1
zpe: 522790.0 jmol-1
zpe.correction: 0.199120 hartree
zpe.thermalcorrener: 0.212615 hartree
zpe.thermalcorrenthalpy: 0.213559 hartree
zpe.thermalcorrgfe: 0.157918 hartree
zpe.sumelectzpe: -667.987473 hartree
zpe.sumelectthermal: -667.973978 hartree
zpe.sumelectthermalent: -667.973034 hartree
zpe.sumelectthermalfe: -668.028675 hartree
dipole: -1.6668 -1.9544 0.0157
dipole: 2.5687
quadrupole: -56.0887 -96.5343 -89.7220
quadrupole: -0.4383 -0.0293 -0.0822
quadrupole: 24.6929 -15.7526 -8.9404 -0.4383 -0.0293 -0.0822
hfenergy: -668.1865928 hartree
pointgroup: C01 [X(C12H11N1O2)]
dipole: 0.6320914 -0.6251428 0.4806063 debye
dipolederiv: -1.9986477 0.2001197 -0.1510029 0.3909361 -0.4332937 0.1316544 -0.3065123 0.1328197 -0.3686662 -0.8286105 -0.1326017 0.107877 -0.1873936 -0.7142836 0.3151009 0.1500932 0.3139328 -0.5686116 -0.24456 -0.0068808 0.005282 0.0625966 -0.3158452 0.0530826 -0.0496065 0.0537989 -0.289298 -0.6141676 -0.0408915 0.0369293 -0.1374515 -0.0031044 0.0163268 0.1153986 0.015466 0.0033865 1.2972702 -0.0916156 0.0617651 -0.1435457 0.0176587 -0.0407123 0.1005644 -0.0403567 -0.0039788 0.1008072 -0.0611405 0.0450543 0.1772279 -0.0676234 -0.0284196 -0.1419048 -0.0270388 -0.0808429 0.1622877 0.11822 -0.0947398 -0.1519568 -0.0025854 -0.106586 0.1168359 -0.1086864 -0.0575338 -1.294329 -0.0170761 0.0226378 0.1423616 -0.0645267 0.0634462 -0.0988968 0.0638031 -0.0329592 1.1718849 -0.0403639 0.0279415 0.0605285 0.2812747 0.0592413 -0.043954 0.0572662 0.3113283 -0.28937 0.1243925 -0.0957738 0.1983157 0.0064726 -0.1202926 -0.1524899 -0.1200563 -0.0521056 -0.0856904 -0.1532913 0.1181062 -0.2382324 -0.0498338 -0.0740972 0.183483 -0.0743194 -0.0916197 0.1031246 0.0262597 -0.0231661 -0.0241506 -0.0172717 -0.088044 0.0163749 -0.0884003 -0.0620549 2.5229884 0.043487 -0.0481614 0.0495562 0.8225756 -0.4644103 -0.0533834 -0.4621489 0.6056222 -0.1143896 0.0687662 -0.0565928 0.0440361 0.0101173 0.0353469 -0.0361912 0.035107 0.0224602 -0.0130865 -0.0051315 0.0050156 -0.1099352 0.2044412 -0.1130493 0.0860933 -0.1137404 0.1484476 0.1346964 0.0180415 -0.0140462 -0.0257721 0.0485261 0.0574915 0.018524 0.0568553 0.0767321 0.0961909 0.0441836 -0.0331242 0.0302581 0.0700932 0.0599562 -0.0221548 0.0599715 0.1012878 0.0675486 -0.0744756 0.0589468 -0.0376255 0.0265111 0.0985778 0.030348 0.0988869 0.0758964 -0.081611 0.0374251 -0.0026076 -0.0563583 -0.1138736 -0.0413204 0.0212604 -0.0472905 0.0597325 -0.0858837 0.0104446 -0.0332697 -0.0323842 0.0703931 -0.0133194 0.0514326 -0.0058599 -0.1280725 0.0419661 -0.0367382 0.0295507 -0.0728085 0.0157688 0.1115494 0.0578904 0.1113001 0.0717027 -0.018024 0.0760478 -0.0573402 0.0952766 0.0421758 0.0921192 -0.0722454 0.0922352 0.0910344 -0.11589 -0.0227057 0.020382 -0.027337 0.1162772 0.0333061 0.0241567 0.0332506 0.1327563 -0.1730479 -0.042973 0.0362135 -0.0594883 0.0795252 0.0321702 0.0493283 0.0321474 0.0911684 0.1295747 -0.047855 -0.0151027 0.0152733 -0.1127875 -0.0479504 -0.0357502 -0.0571875 0.0709254 0.1289685 0.0063527 0.0492258 0.0380731 0.0832183 -0.021168 -0.0086945 -0.0117558 -0.1267377 unknown
polarizability: 261.4029469|-10.8448473|117.9972618|7.0603791|-41.5376822|97.3998001 unknown
InChI: InChI=1S/C12H11NO2/c1-2-15-12(14)11(9-13)8-10-6-4-3-5-7-10/h3-8H,2H2,1H3
charge 0 multiplicity 1
26 atoms
O  -3.134004 0.191127 -0.127021
O  -2.204453 -1.491943 1.197548
N  -0.796101 2.118265 -1.658808
C  1.803267 -0.290187 0.218751
C  0.386782 -0.564089 0.445248
C  2.314686 0.761099 -0.603558
C  2.736708 -1.150336 0.877341
C  -0.756948 0.0517 -0.030462
C  -4.505133 -0.278193 0.250825
C  3.70359 0.935254 -0.75291
C  4.124525 -0.972604 0.724639
C  4.613824 0.073596 -0.093136
C  -2.071774 -0.512248 0.422127
C  -5.49115 0.613874 -0.49409
C  -0.778243 1.177851 -0.91761
H  0.170892 -1.412297 1.113151
H  1.632929 1.438673 -1.123146
H  2.357221 -1.961323 1.510861
H  -4.593244 -1.343343 -0.029697
H  -4.602603 -0.199964 1.348857
H  4.080411 1.745522 -1.38603
H  4.822463 -1.64253 1.237615
H  5.693019 0.216932 -0.215683
H  -6.525457 0.314437 -0.244785
H  -5.356331 1.67158 -0.211689
H  -5.355675 0.526149 -1.585241
