program: Orca
programVersion: 5.0.2
elementType: S O O O O C C C C C C C C C C C C C C C C C C C C C C C H H H H H H H H H H H H H H H H H H H H H H H H
charge: 0
multiplicity: 1
keywords: wb97x-d3
keywords: def2-TZVPP
keywords: def2/J RIJCOSX
keywords: DEFGRID2
keywords: scfconv7
keywords: smallprint printgap noloewdin
keywords: NOSOSCF
formula: C23H24O4S
InChI: InChI=1/C23H24O4S/c1-23(2)19(12-17-8-9-28-22(17)25)20(23)21(24)27-14-16-11-18(26-13-16)10-15-6-4-3-5-7-15/h3-7,11-13,19-20H,8-10,14H2,1-2H3
52 atoms
S  -1.492867 -2.921667 1.750063
O  2.144074 2.5620 -1.180837
O  3.24255 1.815308 0.61523
O  0.040812 -1.017856 2.695079
O  -0.78981 2.146392 2.042892
C  3.845408 -0.759429 -0.954297
C  2.333752 -0.840995 -0.968884
C  3.066281 0.451049 -1.357716
C  4.604649 -0.863807 0.346048
C  4.54055 -1.472086 -2.090886
C  1.544068 -0.91391 0.260181
C  2.863281 1.653312 -0.520896
C  0.576928 -1.813144 0.48532
C  0.156391 -2.947098 -0.396241
C  -0.174513 -1.749739 1.753655
C  -1.239459 -3.420446 0.020222
C  1.516895 3.598754 -0.400878
C  0.403965 3.002335 0.381976
C  -0.752385 2.352292 -0.160723
C  0.328329 2.836151 1.721146
C  -1.439673 1.844149 0.888088
C  -2.704236 1.071039 1.020513
C  -3.198039 0.489449 -0.278508
C  -2.357656 -0.258668 -1.101126
C  -4.528042 0.646035 -0.65686
C  -2.833846 -0.83139 -2.271135
C  -5.011177 0.066604 -1.823739
C  -4.165068 -0.674024 -2.636118
H  1.912579 -1.372531 -1.814967
H  3.026178 0.657631 -2.42153
H  5.549623 -0.322623 0.279722
H  4.068294 -0.493815 1.21414
H  4.841747 -1.912333 0.532192
H  5.531014 -1.045953 -2.260911
H  4.667486 -2.530632 -1.859502
H  3.980752 -1.397002 -3.023633
H  1.743138 -0.192131 1.0452
H  0.867833 -3.769048 -0.288718
H  0.148294 -2.669683 -1.450801
H  -1.339552 -4.500779 -0.051083
H  -2.019547 -2.963701 -0.584893
H  2.238746 4.109494 0.236851
H  1.154218 4.312157 -1.138766
H  -1.017857 2.274533 -1.203022
H  0.96793 3.136839 2.536148
H  -2.550109 0.262202 1.742914
H  -3.483231 1.707125 1.451543
H  -1.317378 -0.39284 -0.831117
H  -5.196544 1.223992 -0.029781
H  -2.162138 -1.405762 -2.896528
H  -6.050584 0.196005 -2.09632
H  -4.537959 -1.125251 -3.546306
elementType: S O C H
totalener: -1590.09443099 hartree
nucrepener: 2881.95273876 hartree
electener: -4472.04716975 hartree
oneelecener: -7904.89819067 hartree
twoeener: 3432.85102093 hartree
cpcmener: -0.04677591 hartree
kineticenergy: 1584.20417714 hartree
xcener: -135.011815648269 hartree
chargesum: -0.0000000
charge: -0.059865 -0.287106 -0.469801 -0.465347 -0.285860 0.147031 0.010050 -0.099894 -0.275243 -0.267961 -0.113290 0.378055 -0.136532 -0.167577 0.276848 -0.115769 0.098352 -0.063130 -0.312927 -0.040572 0.186421 -0.030117 0.036523 -0.255495 -0.167605 -0.175056 -0.156920 -0.165295 0.113341 0.109524 0.104703 0.094833 0.095269 0.097844 0.097377 0.091042 0.120775 0.118612 0.102517 0.133059 0.120876 0.118488 0.122678 0.160890 0.176617 0.101636 0.110874 0.167109 0.140181 0.159864 0.159847 0.160126
qa: -0.0599 -0.2871 -0.4698 -0.4653 -0.2859 0.1470 0.0100 -0.0999 -0.2752 -0.2680 -0.1133 0.3781 -0.1365 -0.1676 0.2768 -0.1158 0.0984 -0.0631 -0.3129 -0.0406 0.1864 -0.0301 0.0365 -0.2555 -0.1676 -0.1751 -0.1569 -0.1653 0.1133 0.1095 0.1047 0.0948 0.0953 0.0978 0.0974 0.0910 0.1208 0.1186 0.1025 0.1331 0.1209 0.1185 0.1227 0.1609 0.1766 0.1016 0.1109 0.1671 0.1402 0.1599 0.1598 0.1601
va: 2.4452 2.1057 2.0232 2.0140 2.2493 3.7471 3.7951 3.8868 3.8955 3.9065 3.7535 4.1698 3.6157 4.0058 4.1601 3.9301 3.8339 3.6453 3.9453 3.9502 3.6093 3.8126 3.5548 3.8390 3.9268 3.8886 3.8880 3.8981 1.0048 1.0247 0.9999 1.0099 1.0019 1.0016 1.0021 1.0042 1.0270 1.0003 1.0072 1.0088 1.0038 1.0086 0.9922 1.0077 0.9974 1.0134 1.0114 0.9809 1.0034 0.9917 0.9895 0.9894
dispcorr: -0.032868901 hartree
energy: -1590.127299886933
dipole: 10.11576 -10.15848 -0.04271 -7.75367 6.55169 -1.20198 -15.50354 11.92375 -3.57979
magnitude: 3.77643 au
magnitude: 9.59893 debye
