program: Orca
programVersion: 5.0.2
elementType: S O O O O C C C C C C C C C C C C C C C C C C C C C C C H H H H H H H H H H H H H H H H H H H H H H H H
charge: 0
multiplicity: 1
keywords: wb97x-d3
keywords: def2-TZVPP
keywords: def2/J RIJCOSX
keywords: DEFGRID2
keywords: scfconv7
keywords: smallprint printgap noloewdin
keywords: NOSOSCF
formula: C23H24O4S
InChI: InChI=1/C23H24O4S/c1-23(2)19(12-17-8-9-28-22(17)25)20(23)21(24)27-14-16-11-18(26-13-16)10-15-6-4-3-5-7-15/h3-7,11-13,19-20H,8-10,14H2,1-2H3
52 atoms
S  -1.460278 -3.409169 -1.102549
O  2.326137 1.431672 1.169622
O  3.119136 2.790665 -0.409833
O  -0.945722 -1.821898 0.920684
O  -1.16596 3.72185 -0.353739
C  4.206972 -0.718042 0.101833
C  2.966093 -0.865791 -0.737243
C  3.639072 0.504657 -0.571163
C  4.171973 -0.921491 1.596702
C  5.483411 -1.237493 -0.518245
C  1.661417 -1.204009 -0.167575
C  3.008357 1.680075 0.063131
C  0.725536 -1.907846 -0.819516
C  0.771312 -2.430846 -2.221766
C  -0.542367 -2.24662 -0.140033
C  -0.102793 -3.679889 -2.282207
C  1.569813 2.508323 1.753438
C  0.341646 2.765524 0.961302
C  -0.745887 1.854624 0.761334
C  0.032603 3.875527 0.255629
C  -1.633349 2.483305 -0.042845
C  -2.944052 2.092126 -0.627969
C  -3.513447 0.855514 0.014354
C  -3.850362 0.856353 1.367612
C  -3.733493 -0.299133 -0.727711
C  -4.394048 -0.270904 1.962695
C  -4.289531 -1.427944 -0.136508
C  -4.618174 -1.418375 1.210252
H  3.136405 -1.265689 -1.729982
H  4.176106 0.810356 -1.461422
H  3.247878 -0.618475 2.079093
H  4.324548 -1.979735 1.816491
H  4.987072 -0.369455 2.067748
H  5.499334 -1.095983 -1.599119
H  6.351007 -0.72377 -0.100423
H  5.598094 -2.304055 -0.318307
H  1.449745 -0.911811 0.853559
H  1.780594 -2.672972 -2.551752
H  0.377042 -1.676188 -2.907263
H  0.448162 -4.570484 -1.984424
H  -0.519606 -3.844751 -3.272964
H  1.325949 2.151897 2.752453
H  2.182568 3.404274 1.855392
H  -0.841029 0.863379 1.174634
H  0.54057 4.815282 0.104599
H  -3.648179 2.922706 -0.515345
H  -2.835609 1.93123 -1.704691
H  -3.687077 1.748788 1.960388
H  -3.473322 -0.317612 -1.779304
H  -4.650458 -0.252692 3.014135
H  -4.461346 -2.314965 -0.731787
H  -5.049588 -2.296678 1.672556
elementType: S O C H
totalener: -1590.09505969 hartree
nucrepener: 2815.32803106 hartree
electener: -4405.42309075 hartree
oneelecener: -7772.47638523 hartree
twoeener: 3367.05329448 hartree
cpcmener: -0.04750391 hartree
kineticenergy: 1584.21214614 hartree
xcener: -135.011706935992 hartree
chargesum: -0.0000000
charge: -0.063594 -0.273939 -0.497258 -0.468161 -0.289428 0.101214 0.032214 -0.115880 -0.270692 -0.262925 -0.124882 0.442923 -0.126261 -0.137377 0.294722 -0.112369 0.069983 -0.097021 -0.334067 -0.021409 0.221394 -0.028689 0.046253 -0.231836 -0.199184 -0.134715 -0.157268 -0.182617 0.114361 0.101075 0.096751 0.098751 0.103708 0.090777 0.096749 0.097100 0.124627 0.093571 0.107579 0.117217 0.119967 0.117664 0.124836 0.161844 0.178787 0.112577 0.101466 0.147076 0.135737 0.160107 0.159630 0.158915
qa: -0.0636 -0.2739 -0.4973 -0.4682 -0.2894 0.1012 0.0322 -0.1159 -0.2707 -0.2629 -0.1249 0.4429 -0.1263 -0.1374 0.2947 -0.1124 0.0700 -0.0970 -0.3341 -0.0214 0.2214 -0.0287 0.0463 -0.2318 -0.1992 -0.1347 -0.1573 -0.1826 0.1144 0.1011 0.0968 0.0988 0.1037 0.0908 0.0967 0.0971 0.1246 0.0936 0.1076 0.1172 0.1200 0.1177 0.1248 0.1618 0.1788 0.1126 0.1015 0.1471 0.1357 0.1601 0.1596 0.1589
va: 2.4452 2.1205 2.0023 2.0028 2.2692 3.7376 3.7643 3.8759 3.8952 3.9087 3.8152 4.1110 3.6792 3.9926 4.1397 3.9466 3.8420 3.7057 3.9481 3.9644 3.6444 3.8206 3.5724 3.9317 3.8729 3.8755 3.8171 3.9174 1.0072 1.0266 1.0108 0.9998 0.9998 1.0056 1.0017 1.0015 1.0277 1.0131 1.0017 1.0075 1.0079 0.9954 1.0057 1.0227 0.9960 1.0041 1.0092 0.9998 1.0127 0.9891 0.9921 0.9906
dispcorr: -0.029745423 hartree
energy: -1590.124805116864
dipole: 15.26478 -13.58775 1.67703 -7.29110 5.77130 -1.51980 -1.01654 -0.18707 -1.20360
magnitude: 2.56337 au
magnitude: 6.51558 debye
