program: Orca
programVersion: 5.0.2
elementType: S O O O O C C C C C C C C C C C C C C C C C C C C C C C H H H H H H H H H H H H H H H H H H H H H H H H
charge: 0
multiplicity: 1
keywords: wb97x-d3
keywords: def2-TZVPP
keywords: def2/J RIJCOSX
keywords: DEFGRID2
keywords: scfconv7
keywords: smallprint printgap noloewdin
keywords: NOSOSCF
formula: C23H24O4S
InChI: InChI=1/C23H24O4S/c1-23(2)19(12-17-8-9-28-22(17)25)20(23)21(24)27-14-16-11-18(26-13-16)10-15-6-4-3-5-7-15/h3-7,11-13,19-20H,8-10,14H2,1-2H3
52 atoms
S  0.219942 1.477151 -3.950401
O  2.25065 1.324703 0.713087
O  1.887924 0.302657 2.672026
O  -1.216818 0.082082 -2.257064
O  -1.839122 2.518606 -0.414908
C  2.340816 -2.259972 0.928441
C  2.375961 -1.508497 -0.379934
C  2.939327 -0.890345 0.888219
C  1.013836 -2.492149 1.610566
C  3.301674 -3.413262 1.079823
C  1.157008 -0.976391 -1.013397
C  2.291701 0.283777 1.533568
C  1.174413 -0.120971 -2.041415
C  2.378575 0.513418 -2.660447
C  -0.095334 0.365248 -2.614965
C  1.991186 1.069541 -4.030039
C  1.496866 2.49297 1.091345
C  0.076215 2.31723 0.691654
C  -0.865285 1.367392 1.208425
C  -0.57056 2.976987 -0.296348
C  -2.004735 1.526644 0.496689
C  -3.322969 0.835405 0.544635
C  -3.192749 -0.484443 1.256412
C  -3.368026 -0.568463 2.634048
C  -2.8347 -1.632739 0.5538
C  -3.182037 -1.773318 3.299891
C  -2.65535 -2.839572 1.214961
C  -2.823159 -2.912299 2.591943
H  3.145498 -1.806058 -1.086665
H  4.024186 -0.825376 0.921675
H  1.159257 -2.664225 2.677971
H  0.307516 -1.66899 1.508434
H  0.537751 -3.382607 1.196644
H  3.537173 -3.586892 2.131309
H  2.869308 -4.331698 0.679243
H  4.239597 -3.228387 0.554696
H  0.194091 -1.302138 -0.631477
H  3.208355 -0.186676 -2.763148
H  2.725453 1.327788 -2.020037
H  2.139842 0.336437 -4.820898
H  2.551198 1.966579 -4.282821
H  1.605793 2.690539 2.157783
H  1.951809 3.31819 0.546868
H  -0.710067 0.657903 2.004417
H  -0.271912 3.767061 -0.967557
H  -4.060635 1.466437 1.04947
H  -3.690206 0.681436 -0.473058
H  -3.648007 0.317222 3.19226
H  -2.692659 -1.583104 -0.518775
H  -3.319209 -1.821851 4.372402
H  -2.379973 -3.723523 0.654246
H  -2.67992 -3.852254 3.108809
elementType: S O C H
totalener: -1590.09236490 hartree
nucrepener: 2923.06176742 hartree
electener: -4513.15413232 hartree
oneelecener: -7988.17279418 hartree
twoeener: 3475.01866186 hartree
cpcmener: -0.04413869 hartree
kineticenergy: 1584.21102191 hartree
xcener: -135.009791908554 hartree
chargesum: 0.0000000
charge: -0.059215 -0.272577 -0.470694 -0.460152 -0.285029 0.113428 -0.059678 -0.082436 -0.272247 -0.265120 -0.035529 0.400766 -0.159145 -0.115670 0.282090 -0.120541 0.070472 -0.090211 -0.267352 -0.036068 0.146763 -0.002847 0.039154 -0.199970 -0.201250 -0.144976 -0.200964 -0.153367 0.116913 0.111244 0.107578 0.039220 0.108275 0.097079 0.094184 0.089332 0.132428 0.098973 0.100757 0.117968 0.120197 0.128319 0.120503 0.159820 0.174283 0.109085 0.107658 0.142586 0.144257 0.160012 0.161034 0.160659
qa: -0.0592 -0.2726 -0.4707 -0.4602 -0.2850 0.1134 -0.0597 -0.0824 -0.2722 -0.2651 -0.0355 0.4008 -0.1591 -0.1157 0.2821 -0.1205 0.0705 -0.0902 -0.2674 -0.0361 0.1468 -0.0028 0.0392 -0.2000 -0.2013 -0.1450 -0.2010 -0.1534 0.1169 0.1112 0.1076 0.0392 0.1083 0.0971 0.0942 0.0893 0.1324 0.0990 0.1008 0.1180 0.1202 0.1283 0.1205 0.1598 0.1743 0.1091 0.1077 0.1426 0.1443 0.1600 0.1610 0.1607
va: 2.4380 2.1220 2.0165 2.0239 2.2452 3.8488 3.8151 3.8558 3.9115 3.8890 3.7171 4.1486 3.5702 3.9607 4.1416 3.9580 3.8078 3.6952 3.8838 3.9160 3.6933 3.8165 3.5744 3.9274 3.8635 3.8784 3.8744 3.8513 1.0030 1.0147 1.0076 0.9978 1.0003 1.0020 1.0020 1.0043 0.9922 1.0100 1.0168 1.0050 1.0065 1.0082 0.9999 1.0088 0.9988 1.0047 1.0145 1.0033 1.0173 0.9887 0.9921 0.9887
dispcorr: -0.034761532 hartree
energy: -1590.127126431825
dipole: 9.71158 -6.90646 2.80512 -16.32823 16.12669 -0.20154 8.90912 -9.66701 -0.75789
magnitude: 2.91268 au
magnitude: 7.40344 debye
