program: Orca
programVersion: 5.0.2
elementType: S O O O O C C C C C C C C C C C C C C C C C C C C C C C H H H H H H H H H H H H H H H H H H H H H H H H
charge: 0
multiplicity: 1
keywords: wb97x-d3
keywords: def2-TZVPP
keywords: def2/J RIJCOSX
keywords: DEFGRID2
keywords: scfconv7
keywords: smallprint printgap noloewdin
keywords: NOSOSCF
formula: C23H24O4S
InChI: InChI=1/C23H24O4S/c1-23(2)19(12-17-8-9-28-22(17)25)20(23)21(24)27-14-16-11-18(26-13-16)10-15-6-4-3-5-7-15/h3-7,11-13,19-20H,8-10,14H2,1-2H3
52 atoms
S  -0.805767 -3.186729 0.206673
O  2.264633 2.158021 -1.141586
O  2.842547 2.024529 1.013396
O  0.331418 -1.832759 2.150574
O  -1.425149 0.789386 0.830423
C  4.918763 -0.103676 0.189799
C  3.686288 -0.768514 -0.370558
C  3.991177 0.715672 -0.647426
C  5.095746 0.102602 1.674795
C  6.216476 -0.469413 -0.494073
C  2.526714 -1.106872 0.456965
C  3.008418 1.696666 -0.137876
C  1.524204 -1.899676 0.059153
C  1.377493 -2.607593 -1.250994
C  0.419028 -2.184533 0.995557
C  -0.103151 -2.9274 -1.450364
C  1.083014 2.906379 -0.800895
C  -0.016704 1.98994 -0.395089
C  -0.900853 1.271565 -1.264862
C  -0.380845 1.645503 0.862992
C  -1.741419 0.56759 -0.471517
C  -2.945497 -0.256632 -0.749485
C  -4.205107 0.460719 -0.324366
C  -4.762942 0.237646 0.930755
C  -4.801743 1.393884 -1.168331
C  -5.896465 0.932034 1.334834
C  -5.935414 2.087224 -0.768671
C  -6.485126 1.859901 0.486802
H  3.83703 -1.40341 -1.23589
H  4.302629 0.90376 -1.669024
H  5.748791 0.956911 1.858342
H  4.17704 0.270585 2.227454
H  5.579961 -0.776943 2.101485
H  6.627668 -1.387118 -0.071236
H  6.086176 -0.622614 -1.56595
H  6.955869 0.321827 -0.358389
H  2.466689 -0.683958 1.45354
H  1.954164 -3.535699 -1.237783
H  1.742136 -2.01092 -2.086908
H  -0.255023 -3.823657 -2.046521
H  -0.632691 -2.100786 -1.922866
H  1.300517 3.644133 -0.029006
H  0.822418 3.441304 -1.71212
H  -0.919724 1.301339 -2.343206
H  -0.016257 1.926427 1.838381
H  -2.9702 -0.462068 -1.820508
H  -2.872392 -1.220157 -0.239072
H  -4.311474 -0.488368 1.596414
H  -4.37603 1.578114 -2.147872
H  -6.319764 0.747135 2.313689
H  -6.391022 2.805304 -1.438199
H  -7.369038 2.400101 0.800197
elementType: S O C H
totalener: -1590.09570977 hartree
nucrepener: 2799.97623858 hartree
electener: -4390.07194835 hartree
oneelecener: -7741.37772119 hartree
twoeener: 3351.30577284 hartree
cpcmener: -0.04767462 hartree
kineticenergy: 1584.21857832 hartree
xcener: -135.008706782411 hartree
chargesum: -0.0000000
charge: -0.073890 -0.282546 -0.476331 -0.460624 -0.284352 0.114740 0.000619 -0.089334 -0.276359 -0.263462 -0.098960 0.396518 -0.169789 -0.136888 0.314530 -0.122961 0.082945 -0.028689 -0.355110 -0.041491 0.205813 -0.044983 0.049396 -0.208255 -0.204323 -0.161354 -0.164356 -0.170750 0.113170 0.108111 0.103300 0.091528 0.095645 0.097388 0.090625 0.097894 0.128711 0.112184 0.096822 0.131200 0.115400 0.122489 0.122178 0.157104 0.170273 0.120803 0.106895 0.141986 0.145135 0.159835 0.160103 0.161468
qa: -0.0739 -0.2825 -0.4763 -0.4606 -0.2844 0.1147 0.0006 -0.0893 -0.2764 -0.2635 -0.0990 0.3965 -0.1698 -0.1369 0.3145 -0.1230 0.0829 -0.0287 -0.3551 -0.0415 0.2058 -0.0450 0.0494 -0.2083 -0.2043 -0.1614 -0.1644 -0.1708 0.1132 0.1081 0.1033 0.0915 0.0956 0.0974 0.0906 0.0979 0.1287 0.1122 0.0968 0.1312 0.1154 0.1225 0.1222 0.1571 0.1703 0.1208 0.1069 0.1420 0.1451 0.1598 0.1601 0.1615
va: 2.4174 2.1166 2.0177 2.0204 2.2437 3.7887 3.8043 3.8468 3.8853 3.8984 3.7918 4.1752 3.5931 3.9880 4.1316 3.9378 3.8171 3.5515 3.9982 3.9303 3.5368 3.7580 3.6007 3.9515 3.9422 3.8982 3.9011 3.8883 1.0050 1.0272 0.9991 1.0149 1.0015 1.0023 1.0040 1.0019 1.0342 1.0013 1.0082 1.0094 1.0070 1.0114 0.9929 1.0109 1.0049 1.0091 1.0267 1.0072 1.0037 0.9903 0.9904 0.9892
dispcorr: -0.029866127 hartree
energy: -1590.125575900913
dipole: 14.21668 -12.98339 1.23329 0.87554 -1.19219 -0.31665 -7.49361 3.78220 -3.71141
magnitude: 3.92375 au
magnitude: 9.97338 debye
