program: Orca
programVersion: 5.0.2
elementType: S O O O O C C C C C C C C C C C C C C C C C C C C C C C H H H H H H H H H H H H H H H H H H H H H H H H
charge: 0
multiplicity: 1
keywords: wb97x-d3
keywords: def2-TZVPP
keywords: def2/J RIJCOSX
keywords: DEFGRID2
keywords: scfconv7
keywords: smallprint printgap noloewdin
keywords: NOSOSCF
formula: C23H24O4S
InChI: InChI=1/C23H24O4S/c1-23(2)19(12-17-8-9-28-22(17)25)20(23)21(24)27-14-16-11-18(26-13-16)10-15-6-4-3-5-7-15/h3-7,11-13,19-20H,8-10,14H2,1-2H3
52 atoms
S  -1.421363 -2.503249 0.575726
O  2.598779 2.343886 -0.119652
O  2.415572 0.664665 1.346291
O  0.728127 -3.507815 1.692977
O  -1.530074 2.40815 -0.92895
C  4.641588 -0.666015 -0.441153
C  3.323075 -1.175825 -0.898661
C  3.532104 0.328055 -0.750145
C  5.095923 -0.898728 0.977667
C  5.775692 -0.681395 -1.436573
C  2.428681 -1.955073 -0.017696
C  2.804322 1.085463 0.281024
C  1.095672 -1.915875 -0.075278
C  0.255175 -1.010112 -0.916503
C  0.300004 -2.758659 0.842177
C  -1.173854 -1.553703 -0.954507
C  1.694511 3.149087 0.645519
C  0.281977 2.838085 0.278768
C  -0.842689 2.697332 1.153373
C  -0.199464 2.648215 -0.972469
C  -1.918515 2.448004 0.368076
C  -3.365599 2.260815 0.656028
C  -3.913577 0.953812 0.137506
C  -4.279578 0.81742 -1.200675
C  -4.046079 -0.143472 0.982078
C  -4.758926 -0.39211 -1.683129
C  -4.536162 -1.352283 0.504255
C  -4.888025 -1.482552 -0.831785
H  3.259708 -1.47496 -1.942642
H  3.649442 0.864875 -1.683636
H  5.637188 -1.8446 1.034837
H  5.78161 -0.110119 1.290823
H  4.287778 -0.9426 1.702833
H  6.510872 0.090452 -1.203333
H  6.286511 -1.645641 -1.413338
H  5.424779 -0.514888 -2.455499
H  2.897965 -2.633023 0.688906
H  0.645856 -0.903517 -1.928725
H  0.246485 -0.012269 -0.470418
H  -1.333945 -2.217811 -1.801831
H  -1.911343 -0.755648 -0.996665
H  1.858095 3.028422 1.716503
H  1.952455 4.175749 0.388834
H  -0.843825 2.779683 2.229069
H  0.260607 2.645215 -1.948176
H  -3.496429 2.322378 1.736738
H  -3.931616 3.091614 0.223601
H  -4.197896 1.664778 -1.870811
H  -3.767859 -0.05182 2.025151
H  -5.035306 -0.4828 -2.725736
H  -4.63945 -2.193113 1.177588
H  -5.265783 -2.424945 -1.206469
elementType: S O C H
totalener: -1590.09300816 hartree
nucrepener: 2846.77181488 hartree
electener: -4436.86482304 hartree
oneelecener: -7834.47565702 hartree
twoeener: 3397.61083398 hartree
cpcmener: -0.04466242 hartree
kineticenergy: 1584.22314662 hartree
xcener: -135.015286139109 hartree
chargesum: 0.0000000
charge: -0.056555 -0.289222 -0.484911 -0.463311 -0.284686 0.116816 -0.025284 -0.085587 -0.294477 -0.261913 -0.119182 0.373527 -0.120737 -0.042382 0.276343 -0.097352 0.114704 -0.034209 -0.325660 -0.061362 0.179568 -0.045035 0.061692 -0.161318 -0.207638 -0.174942 -0.180395 -0.153886 0.119306 0.098049 0.102358 0.103126 0.096100 0.097051 0.095348 0.089692 0.129585 0.110679 0.047006 0.133296 0.078064 0.114544 0.118940 0.164783 0.169847 0.107086 0.115550 0.139695 0.137422 0.157689 0.163674 0.158506
qa: -0.0566 -0.2892 -0.4849 -0.4633 -0.2847 0.1168 -0.0253 -0.0856 -0.2945 -0.2619 -0.1192 0.3735 -0.1207 -0.0424 0.2763 -0.0974 0.1147 -0.0342 -0.3257 -0.0614 0.1796 -0.0450 0.0617 -0.1613 -0.2076 -0.1749 -0.1804 -0.1539 0.1193 0.0980 0.1024 0.1031 0.0961 0.0971 0.0953 0.0897 0.1296 0.1107 0.0470 0.1333 0.0781 0.1145 0.1189 0.1648 0.1698 0.1071 0.1156 0.1397 0.1374 0.1577 0.1637 0.1585
va: 2.4656 2.1232 1.9937 2.0243 2.2575 3.7633 3.8738 3.8642 3.9012 3.9004 3.8450 4.1055 3.5808 3.9946 4.2297 3.9634 3.8086 3.5836 3.9898 3.9205 3.6508 3.8201 3.5441 3.8752 3.8678 3.8939 3.8007 3.8545 1.0064 1.0308 0.9982 1.0004 1.0140 1.0019 1.0018 1.0046 1.0154 1.0039 1.0532 1.0067 1.0249 1.0147 0.9925 1.0030 0.9992 1.0098 0.9984 1.0103 1.0098 0.9916 0.9934 0.9909
dispcorr: -0.032000613 hartree
energy: -1590.125008772336
dipole: 13.27721 -12.84513 0.43208 2.87726 -0.57546 2.30180 -7.10527 4.47475 -2.63051
magnitude: 3.52201 au
magnitude: 8.95225 debye
