program: Orca
programVersion: 5.0.2
elementType: S O O O O C C C C C C C C C C C C C C C C C C C C C C C H H H H H H H H H H H H H H H H H H H H H H H H
charge: 0
multiplicity: 1
keywords: wb97x-d3
keywords: def2-TZVPP
keywords: def2/J RIJCOSX
keywords: DEFGRID2
keywords: scfconv7
keywords: smallprint printgap noloewdin
keywords: NOSOSCF
formula: C23H24O4S
InChI: InChI=1/C23H24O4S/c1-23(2)19(12-17-8-9-28-22(17)25)20(23)21(24)27-14-16-11-18(26-13-16)10-15-6-4-3-5-7-15/h3-7,11-13,19-20H,8-10,14H2,1-2H3
52 atoms
S  -1.397296 -2.406675 -0.896778
O  2.03017 1.109129 -1.516626
O  3.307334 2.382043 -0.191724
O  -0.520807 -1.78842 1.506968
O  -0.709362 2.560667 1.574195
C  4.569964 -0.372924 0.583726
C  3.492916 -1.177386 -0.104276
C  3.978056 0.140366 -0.687619
C  4.269278 0.305187 1.898358
C  5.974437 -0.919612 0.502047
C  2.128348 -1.295212 0.433409
C  3.084914 1.330024 -0.742471
C  1.125007 -1.854508 -0.250046
C  1.17425 -2.382253 -1.648649
C  -0.221892 -1.958085 0.345126
C  -0.208746 -2.161394 -2.253411
C  1.033365 2.146589 -1.620805
C  0.135705 2.144758 -0.434511
C  -1.049483 1.35824 -0.2532
C  0.288341 2.852483 0.710592
C  -1.522794 1.646806 0.982233
C  -2.682075 1.164682 1.782054
C  -3.760828 0.562411 0.921607
C  -4.530114 1.378096 0.092258
C  -4.01434 -0.804181 0.937812
C  -5.530652 0.838924 -0.701812
C  -5.01766 -1.348625 0.143705
C  -5.777412 -0.529971 -0.67849
H  3.828056 -2.044799 -0.664179
H  4.578727 0.045391 -1.589017
H  3.255954 0.695619 1.979109
H  4.413896 -0.400089 2.718385
H  4.952407 1.140492 2.058332
H  6.155683 -1.641338 1.300352
H  6.159122 -1.420739 -0.449202
H  6.708885 -0.11855 0.60403
H  1.924441 -0.905335 1.425832
H  1.408003 -3.450437 -1.64083
H  1.932491 -1.885595 -2.25374
H  -0.433157 -2.85916 -3.056682
H  -0.317288 -1.143783 -2.629397
H  1.50916 3.116079 -1.769048
H  0.478524 1.901329 -2.524218
H  -1.488078 0.67766 -0.966762
H  1.013811 3.580635 1.037808
H  -2.34369 0.429761 2.518956
H  -3.091942 2.002138 2.353977
H  -4.344533 2.446106 0.07125
H  -3.422601 -1.451007 1.574734
H  -6.121124 1.486191 -1.338032
H  -5.201117 -2.415405 0.167022
H  -6.558793 -0.952343 -1.297464
elementType: S O C H
totalener: -1590.09173434 hartree
nucrepener: 2862.66745773 hartree
electener: -4452.75919207 hartree
oneelecener: -7866.77585649 hartree
twoeener: 3414.01666442 hartree
cpcmener: -0.04246645 hartree
kineticenergy: 1584.19026229 hartree
xcener: -135.004494962730 hartree
chargesum: 0.0000000
charge: -0.065382 -0.273856 -0.472855 -0.467668 -0.286067 0.113647 -0.060764 -0.079536 -0.291322 -0.264334 -0.094134 0.397862 -0.106643 -0.151795 0.303280 -0.109975 0.057585 -0.071422 -0.362995 -0.016708 0.236377 -0.058882 0.073993 -0.216198 -0.230768 -0.146445 -0.148253 -0.176098 0.117054 0.114339 0.082204 0.105169 0.103679 0.094650 0.089632 0.096809 0.132712 0.112752 0.093990 0.130569 0.113655 0.131938 0.125585 0.167748 0.171653 0.105600 0.118428 0.145093 0.138059 0.159333 0.157758 0.160949
qa: -0.0654 -0.2739 -0.4729 -0.4677 -0.2861 0.1136 -0.0608 -0.0795 -0.2913 -0.2643 -0.0941 0.3979 -0.1066 -0.1518 0.3033 -0.1100 0.0576 -0.0714 -0.3630 -0.0167 0.2364 -0.0589 0.0740 -0.2162 -0.2308 -0.1464 -0.1483 -0.1761 0.1171 0.1143 0.0822 0.1052 0.1037 0.0947 0.0896 0.0968 0.1327 0.1128 0.0940 0.1306 0.1137 0.1319 0.1256 0.1677 0.1717 0.1056 0.1184 0.1451 0.1381 0.1593 0.1578 0.1609
va: 2.4312 2.1166 2.0153 2.0054 2.2708 3.8236 3.8410 3.8607 3.9171 3.8877 3.7986 4.1526 3.5654 3.9962 4.1505 3.9250 3.7890 3.6442 3.9768 3.9529 3.5857 3.8150 3.5134 3.9435 3.9062 3.8735 3.8762 3.9039 1.0022 1.0140 1.0026 1.0017 1.0037 1.0023 1.0037 1.0018 1.0213 1.0060 1.0133 1.0119 1.0071 1.0088 0.9975 1.0022 1.0059 1.0083 1.0085 1.0014 1.0276 0.9896 0.9917 0.9888
dispcorr: -0.032524401 hartree
energy: -1590.124258738408
dipole: 14.21283 -12.95139 1.26144 -2.87530 2.04291 -0.83239 -1.62543 -0.96586 -2.59129
magnitude: 2.99981 au
magnitude: 7.62492 debye
