program: Orca
programVersion: 5.0.2
elementType: S O O O O C C C C C C C C C C C C C C C C C C C C C C C H H H H H H H H H H H H H H H H H H H H H H H H
charge: 0
multiplicity: 1
keywords: wb97x-d3
keywords: def2-TZVPP
keywords: def2/J RIJCOSX
keywords: DEFGRID2
keywords: scfconv7
keywords: smallprint printgap noloewdin
keywords: NOSOSCF
formula: C23H24O4S
InChI: InChI=1/C23H24O4S/c1-23(2)19(12-17-8-9-28-22(17)25)20(23)21(24)27-14-16-11-18(26-13-16)10-15-6-4-3-5-7-15/h3-7,11-13,19-20H,8-10,14H2,1-2H3
52 atoms
S  -0.75216 -2.889522 0.575006
O  2.217065 1.980742 -1.102704
O  2.660231 1.49363 1.032404
O  0.872712 -2.286521 2.544418
O  -1.606363 0.682564 0.710679
C  5.07568 -0.141566 0.041461
C  3.912847 -1.00345 -0.309363
C  3.928222 0.473128 -0.728981
C  5.374248 0.219901 1.4759
C  6.330471 -0.341902 -0.7771
C  2.919735 -1.469878 0.677466
C  2.903657 1.358336 -0.145016
C  1.691604 -1.857029 0.320885
C  1.114523 -1.820388 -1.056754
C  0.724229 -2.304656 1.34342
C  -0.086635 -2.765445 -1.113371
C  1.065029 2.748701 -0.707009
C  -0.096976 1.872733 -0.398332
C  -0.99186 1.257957 -1.335708
C  -0.521612 1.477319 0.824764
C  -1.887755 0.548268 -0.610374
C  -3.094056 -0.240917 -0.972691
C  -4.36163 0.478038 -0.575636
C  -4.860369 0.376789 0.720711
C  -5.024502 1.294346 -1.487463
C  -5.993252 1.084419 1.099555
C  -6.160609 1.999168 -1.1129
C  -6.64601 1.899654 0.184199
H  4.039974 -1.672984 -1.156081
H  4.104052 0.636072 -1.785563
H  6.063765 -0.517263 1.890484
H  5.865466 1.192372 1.529354
H  4.504916 0.25271 2.125229
H  6.934269 0.566958 -0.789455
H  6.93922 -1.140938 -0.351028
H  6.105404 -0.608626 -1.810294
H  3.202893 -1.509084 1.724027
H  1.84342 -2.100965 -1.817426
H  0.791404 -0.800921 -1.283576
H  0.201411 -3.762008 -1.443333
H  -0.868414 -2.396613 -1.773847
H  1.308707 3.39977 0.132734
H  0.851683 3.379409 -1.567916
H  -0.970891 1.34692 -2.410784
H  -0.174751 1.680553 1.825483
H  -3.077198 -0.405989 -2.050434
H  -3.056033 -1.224301 -0.496203
H  -4.362893 -0.26317 1.439798
H  -4.648836 1.378826 -2.500455
H  -6.367078 0.998243 2.111677
H  -6.666457 2.626919 -1.835144
H  -7.529374 2.450961 0.479138
elementType: S O C H
totalener: -1590.09437090 hartree
nucrepener: 2801.15455006 hartree
electener: -4391.24892096 hartree
oneelecener: -7743.30797904 hartree
twoeener: 3352.05905808 hartree
cpcmener: -0.04725383 hartree
kineticenergy: 1584.21834796 hartree
xcener: -135.010216917352 hartree
chargesum: -0.0000000
charge: -0.068791 -0.287939 -0.486744 -0.457460 -0.279379 0.126352 -0.053070 -0.079711 -0.287760 -0.263490 -0.093185 0.396742 -0.131342 -0.099015 0.291522 -0.137473 0.080111 -0.057265 -0.333872 -0.018704 0.194094 -0.062686 0.073739 -0.218403 -0.209625 -0.159874 -0.155883 -0.176205 0.119523 0.094846 0.098780 0.104360 0.089492 0.098011 0.096256 0.088868 0.131232 0.108001 0.100967 0.135292 0.123103 0.122913 0.122889 0.158093 0.169838 0.113313 0.114814 0.140813 0.142817 0.159793 0.159897 0.161408
qa: -0.0688 -0.2879 -0.4867 -0.4575 -0.2794 0.1264 -0.0531 -0.0797 -0.2878 -0.2635 -0.0932 0.3967 -0.1313 -0.0990 0.2915 -0.1375 0.0801 -0.0573 -0.3339 -0.0187 0.1941 -0.0627 0.0737 -0.2184 -0.2096 -0.1599 -0.1559 -0.1762 0.1195 0.0948 0.0988 0.1044 0.0895 0.0980 0.0963 0.0889 0.1312 0.1080 0.1010 0.1353 0.1231 0.1229 0.1229 0.1581 0.1698 0.1133 0.1148 0.1408 0.1428 0.1598 0.1599 0.1614
va: 2.4292 2.1118 2.0004 2.0277 2.2458 3.7854 3.8597 3.8525 3.8891 3.9004 3.7865 4.1036 3.5681 3.9435 4.1497 3.9558 3.8271 3.5404 3.9546 3.9140 3.5578 3.7905 3.5639 3.9565 3.9494 3.8980 3.8875 3.8939 1.0067 1.0317 0.9999 0.9996 1.0182 1.0018 1.0024 1.0040 1.0181 1.0095 1.0287 1.0050 1.0029 1.0091 0.9919 1.0099 1.0044 1.0121 1.0103 1.0118 1.0047 0.9902 0.9900 0.9893
dispcorr: -0.030620897 hartree
energy: -1590.124991798967
dipole: 14.12777 -13.23058 0.89718 3.25348 -3.03021 0.22327 -9.38895 5.53126 -3.85769
magnitude: 3.96693 au
magnitude: 10.08314 debye
