program: Orca
programVersion: 5.0.2
elementType: S O O O O C C C C C C C C C C C C C C C C C C C C C C C H H H H H H H H H H H H H H H H H H H H H H H H
charge: 0
multiplicity: 1
keywords: wb97x-d3
keywords: def2-TZVPP
keywords: def2/J RIJCOSX
keywords: DEFGRID2
keywords: scfconv7
keywords: smallprint printgap noloewdin
keywords: NOSOSCF
formula: C23H24O4S
InChI: InChI=1/C23H24O4S/c1-23(2)19(12-17-8-9-28-22(17)25)20(23)21(24)27-14-16-11-18(26-13-16)10-15-6-4-3-5-7-15/h3-7,11-13,19-20H,8-10,14H2,1-2H3
52 atoms
S  -1.528556 -3.450291 0.685665
O  2.767575 1.881677 0.475776
O  2.371919 2.686875 -1.569614
O  -0.84642 -1.108427 1.659117
O  -1.313376 2.040255 1.906047
C  3.847896 -0.655295 -0.6614
C  2.429761 -0.797261 -1.169481
C  3.217786 0.497631 -1.386699
C  4.134282 -0.674184 0.821511
C  4.90278 -1.390419 -1.455851
C  1.296177 -0.874788 -0.245825
C  2.74587 1.791925 -0.843335
C  0.413878 -1.882778 -0.244013
C  0.432124 -3.097471 -1.121001
C  -0.631792 -1.932717 0.797266
C  -0.907892 -3.817369 -0.981566
C  2.12083 3.001927 1.114988
C  0.654386 2.775457 1.187654
C  -0.339475 3.051181 0.192341
C  -0.000922 2.159693 2.199971
C  -1.512041 2.583686 0.677607
C  -2.878349 2.503529 0.104486
C  -3.226612 1.090777 -0.299351
C  -4.037393 0.296147 0.504437
C  -2.710312 0.552122 -1.474946
C  -4.342199 -1.006527 0.131838
C  -3.015299 -0.748246 -1.851336
C  -3.836044 -1.53026 -1.049042
H  2.324485 -1.394241 -2.068647
H  3.538616 0.618456 -2.415265
H  3.317164 -0.32782 1.446566
H  4.35551 -1.70016 1.120356
H  5.014523 -0.07211 1.051027
H  4.96808 -2.431406 -1.135659
H  4.691317 -1.38112 -2.525447
H  5.882334 -0.932996 -1.304677
H  1.17443 -0.095915 0.498682
H  1.240271 -3.763036 -0.808515
H  0.6107 -2.847488 -2.167432
H  -0.810998 -4.894034 -1.098512
H  -1.638221 -3.456235 -1.704568
H  2.557287 3.034976 2.111073
H  2.370686 3.931424 0.604177
H  -0.198795 3.536042 -0.760129
H  0.324192 1.776576 3.154927
H  -3.613915 2.880436 0.819407
H  -2.913359 3.160967 -0.765314
H  -4.441119 0.701281 1.424811
H  -2.070126 1.158953 -2.105139
H  -4.975085 -1.613251 0.766536
H  -2.614341 -1.15078 -2.772891
H  -4.074075 -2.544805 -1.340434
elementType: S O C H
totalener: -1590.09331736 hartree
nucrepener: 2894.98323958 hartree
electener: -4485.07655694 hartree
oneelecener: -7932.22992582 hartree
twoeener: 3447.15336888 hartree
cpcmener: -0.05019417 hartree
kineticenergy: 1584.22321981 hartree
xcener: -135.012691520217 hartree
chargesum: 0.0000000
charge: -0.061484 -0.265718 -0.494076 -0.468746 -0.279267 0.153203 0.004084 -0.146080 -0.260645 -0.269073 -0.079248 0.428778 -0.189706 -0.123915 0.317154 -0.137537 0.052532 -0.050396 -0.306626 -0.055239 0.186601 -0.046730 0.072965 -0.210950 -0.225327 -0.135270 -0.149881 -0.185042 0.113021 0.106466 0.091958 0.094861 0.104643 0.095811 0.091420 0.097515 0.111802 0.111048 0.100120 0.129700 0.114466 0.116781 0.125897 0.161184 0.177543 0.110917 0.116413 0.139967 0.141869 0.153428 0.160067 0.158740
qa: -0.0615 -0.2657 -0.4941 -0.4687 -0.2793 0.1532 0.0041 -0.1461 -0.2606 -0.2691 -0.0792 0.4288 -0.1897 -0.1239 0.3172 -0.1375 0.0525 -0.0504 -0.3066 -0.0552 0.1866 -0.0467 0.0730 -0.2109 -0.2253 -0.1353 -0.1499 -0.1850 0.1130 0.1065 0.0920 0.0949 0.1046 0.0958 0.0914 0.0975 0.1118 0.1110 0.1001 0.1297 0.1145 0.1168 0.1259 0.1612 0.1775 0.1109 0.1164 0.1400 0.1419 0.1534 0.1601 0.1587
va: 2.4163 2.1317 1.9980 2.0120 2.2563 3.7093 3.7995 3.9234 3.8953 3.9074 3.7781 4.1189 3.6562 3.9603 4.1099 3.9587 3.8411 3.5852 4.0063 3.9316 3.6707 3.8000 3.5267 3.9434 3.9077 3.8520 3.8115 3.8258 1.0030 1.0245 1.0055 1.0023 1.0024 1.0025 1.0046 1.0012 1.0213 1.0016 1.0111 1.0098 1.0029 1.0013 1.0048 1.0173 0.9947 1.0093 1.0080 1.0049 1.0047 0.9931 0.9896 0.9901
dispcorr: -0.033050049 hartree
energy: -1590.126367408828
dipole: 14.24289 -12.66540 1.57749 -6.70445 5.08524 -1.61922 -8.81795 7.42260 -1.39535
magnitude: 2.65656 au
magnitude: 6.75245 debye
