program: Orca
programVersion: 5.0.2
elementType: S O O O O C C C C C C C C C C C C C C C C C C C C C C C H H H H H H H H H H H H H H H H H H H H H H H H
charge: 0
multiplicity: 1
keywords: wb97x-d3
keywords: def2-TZVPP
keywords: def2/J RIJCOSX
keywords: DEFGRID2
keywords: scfconv7
keywords: smallprint printgap noloewdin
keywords: NOSOSCF
formula: C23H24O4S
InChI: InChI=1/C23H24O4S/c1-23(2)19(12-17-8-9-28-22(17)25)20(23)21(24)27-14-16-11-18(26-13-16)10-15-6-4-3-5-7-15/h3-7,11-13,19-20H,8-10,14H2,1-2H3
52 atoms
S  -0.666405 -3.11663 0.227085
O  2.282143 2.07936 -1.00562
O  2.249396 1.252147 1.069917
O  0.829621 -2.727226 2.348119
O  -1.802732 0.732505 -1.670013
C  4.988161 -0.026867 0.404681
C  3.969998 -0.975909 -0.118256
C  3.89472 0.503684 -0.503434
C  5.039917 0.324331 1.871059
C  6.357025 -0.073919 -0.232824
C  2.926813 -1.58918 0.728526
C  2.748312 1.298956 -0.031856
C  1.737351 -1.966198 0.252095
C  1.222659 -1.757394 -1.135155
C  0.742953 -2.589134 1.148993
C  0.088592 -2.750836 -1.387688
C  1.066577 2.81145 -0.763619
C  -0.131604 1.93029 -0.829337
C  -0.829002 1.281857 0.242089
C  -0.770399 1.552517 -1.962426
C  -1.835787 0.574347 -0.321024
C  -2.953128 -0.223822 0.245651
C  -4.24378 0.56012 0.241136
C  -5.070352 0.569655 -0.87902
C  -4.603764 1.323307 1.348383
C  -6.232293 1.330128 -0.893011
C  -5.766477 2.081336 1.338836
C  -6.583039 2.089523 0.215562
H  4.272844 -1.601761 -0.954546
H  4.19929 0.724622 -1.519152
H  5.416109 1.339406 2.006584
H  4.085388 0.254037 2.384204
H  5.732717 -0.35101 2.375911
H  6.862597 0.888351 -0.136996
H  6.977953 -0.826872 0.255439
H  6.30495 -0.321425 -1.293564
H  3.153167 -1.763991 1.775522
H  2.001124 -1.877481 -1.888739
H  0.842306 -0.735692 -1.227709
H  0.457451 -3.682196 -1.813523
H  -0.673008 -2.345482 -2.049763
H  1.121841 3.341769 0.187288
H  1.039644 3.55345 -1.559289
H  -0.618432 1.350985 1.297198
H  -0.606843 1.779589 -3.004664
H  -3.073082 -1.154171 -0.31452
H  -2.686037 -0.499879 1.265805
H  -4.807376 -0.025125 -1.745782
H  -3.968529 1.322582 2.226415
H  -6.865788 1.327519 -1.770667
H  -6.035083 2.665731 2.209475
H  -7.48953 2.680581 0.205829
elementType: S O C H
totalener: -1590.09479302 hartree
nucrepener: 2789.37548539 hartree
electener: -4379.47027842 hartree
oneelecener: -7719.72379983 hartree
twoeener: 3340.25352141 hartree
cpcmener: -0.04515948 hartree
kineticenergy: 1584.21826885 hartree
xcener: -135.009336093893 hartree
chargesum: -0.0000000
charge: -0.067476 -0.289997 -0.489859 -0.457550 -0.285600 0.117199 -0.040754 -0.078390 -0.291331 -0.264512 -0.103261 0.404462 -0.111791 -0.084515 0.283977 -0.124228 0.070971 -0.067426 -0.320345 -0.024879 0.221375 -0.068368 0.056520 -0.213603 -0.205331 -0.161187 -0.158177 -0.174479 0.118390 0.094561 0.103746 0.093063 0.100072 0.097559 0.096192 0.089510 0.129681 0.109033 0.075918 0.131509 0.120707 0.121619 0.123367 0.155043 0.174481 0.113631 0.113540 0.142792 0.143746 0.159288 0.160335 0.160772
qa: -0.0675 -0.2900 -0.4899 -0.4575 -0.2856 0.1172 -0.0408 -0.0784 -0.2913 -0.2645 -0.1033 0.4045 -0.1118 -0.0845 0.2840 -0.1242 0.0710 -0.0674 -0.3203 -0.0249 0.2214 -0.0684 0.0565 -0.2136 -0.2053 -0.1612 -0.1582 -0.1745 0.1184 0.0946 0.1037 0.0931 0.1001 0.0976 0.0962 0.0895 0.1297 0.1090 0.0759 0.1315 0.1207 0.1216 0.1234 0.1550 0.1745 0.1136 0.1135 0.1428 0.1437 0.1593 0.1603 0.1608
va: 2.4250 2.1132 1.9956 2.0278 2.2481 3.7719 3.8775 3.8549 3.8933 3.9016 3.8175 4.0688 3.5607 3.9743 4.1526 3.9362 3.8501 3.5725 3.9511 3.9323 3.5326 3.7933 3.6106 3.9563 3.9399 3.8971 3.8920 3.8918 1.0069 1.0321 0.9995 1.0163 0.9993 1.0017 1.0021 1.0041 1.0164 1.0080 1.0297 1.0054 1.0085 1.0053 0.9958 1.0205 0.9940 1.0063 1.0106 1.0090 1.0038 0.9904 0.9899 0.9895
dispcorr: -0.030229129 hartree
energy: -1590.125022154220
dipole: 14.72286 -13.39215 1.33071 5.61113 -4.85405 0.75708 -3.10909 0.00604 -3.10305
magnitude: 3.46019 au
magnitude: 8.79509 debye
