program: Gaussian 09
title: 000074833
version: EM64L-G09RevD.01
frameworkgroup: C1[X(C9H12N2O3S)]
method: RPBEPBE
basis: SDD
operation: Freq
keyword: #p
keyword: freq=noraman
keyword: PBEPBE/SDD
title: #p freq=noraman PBEPBE/SDD
converged: YES YES NO NO
title: Mulliken charges:
elementType: S O O O N N C C C C C C C C C H H H H H H H H H H H H
charge: 0.949030 -0.538433 -0.541095 -0.268517 -0.367891 -0.719088 0.524492 -0.039958 -0.534803 -0.346153 -0.429816 -0.240134 -0.230746 0.266218 -0.769404 0.232395 0.274886 0.266232 0.245811 0.283552 0.285698 0.302135 0.334748 0.334997 0.258239 0.256186 0.211421
chargesum: 0.00000
title: Mulliken charges with hydrogens summed into heavy atoms:
elementType: S O O O N N C C C C C C C C C
charge: 0.949030 -0.538433 -0.541095 -0.268517 -0.065756 -0.049343 0.524492 -0.039958 -0.027522 -0.079921 -0.184005 0.043418 0.054952 0.266218 -0.043559
polarizability: 2.02374111e+02 4.91455080e+00 1.37567666e+02 8.54934535e+00 7.51841026e+00 1.04171124e+02
1716.lowfreq: -25.8562 -6.0643 -0.0021 0.0009 0.0019 2.2029 8.2025 23.2095 34.9547
frequency: -24.6112 23.0632 34.8963 47.4483 50.6889 94.0198 108.6818 123.9319 170.4553 199.6121 219.0236 263.3034 270.1712 305.0323 313.9524 357.7898 372.6559 408.7478 424.9054 450.9344 486.5354 526.4478 557.5115 606.1007 607.9579 623.1863 636.0209 729.0628 792.3617 797.0658 815.7984 852.0694 853.1788 855.5332 908.5953 967.2088 978.5021 985.6415 995.2309 1020.0327 1041.5415 1054.6965 1071.0642 1087.9330 1118.6539 1183.7914 1210.6223 1233.8506 1255.7116 1298.5978 1349.1057 1388.3213 1390.4677 1407.4176 1449.1269 1459.5897 1466.4443 1474.2543 1485.4559 1533.9709 1596.3039 1598.4620 1619.0329 2989.8358 2997.4321 3046.1274 3099.0393 3100.6676 3133.7052 3145.6835 3162.8557 3166.4908 3362.3514 3529.3361 3557.6369
redmass: 2.7283 5.2523 2.8683 1.6385 3.7821 4.3262 1.4696 7.5029 5.1132 7.2129 5.5544 2.4992 7.4890 4.5986 3.4602 5.0471 3.9185 2.8535 9.4612 3.0246 3.5768 3.4777 1.8952 4.0866 1.6462 5.3480 4.5750 3.6947 2.8200 3.8239 2.4950 1.2571 1.7708 2.7058 4.0258 1.3823 1.6391 1.3902 5.0706 2.3118 1.6480 2.5140 1.4906 3.6696 1.3553 1.1274 2.8696 1.2665 1.8834 1.2737 1.4777 1.4661 3.4207 2.4545 1.0452 1.2244 1.1683 1.8526 1.7614 1.0853 5.9480 7.4302 6.2278 1.0589 1.0361 1.1026 1.0987 1.1000 1.0895 1.0886 1.0954 1.0972 1.0415 1.0999 1.0782
irintensity: 3.3234 0.7495 1.3576 7.1883 0.3574 10.6618 37.7303 2.9762 1.0432 3.5887 0.5773 6.4630 7.9840 17.0856 4.8909 6.5796 2.5102 0.2953 51.4027 34.6821 135.9046 79.9276 56.4090 3.4773 54.8862 1.9104 37.8469 1.4363 59.8773 20.6983 184.9754 2.0831 24.9615 19.5302 58.7278 0.3069 4.6346 0.2949 0.4818 14.2596 12.3178 31.8117 32.4348 4.5190 4.7343 3.3592 2.1818 0.2942 154.3704 4.6611 10.9709 51.4703 22.4389 23.2603 17.1444 70.7723 34.5753 1.6142 158.6244 22.6412 9.4578 0.2608 174.2433 36.4635 11.2180 21.1597 10.8547 16.3186 9.4747 2.2099 1.3435 6.3862 26.3624 24.1865 14.9973
temp: 298.150 k
press: 1.00000 atm
elementType: 16 8 8 8 7 7 6 6 6 6 6 6 6 6 6 1 1 1 1 1 1 1 1 1 1 1 1
symmnumber: 1
zpe: 531733.7 jmol-1
zpe.correction: 0.202527 hartree
zpe.thermalcorrener: 0.218215 hartree
zpe.thermalcorrenthalpy: 0.219159 hartree
zpe.thermalcorrgfe: 0.157251 hartree
zpe.sumelectzpe: -1082.103727 hartree
zpe.sumelectthermal: -1082.088039 hartree
zpe.sumelectthermalent: -1082.087095 hartree
zpe.sumelectthermalfe: -1082.149003 hartree
dipole: -2.8885 0.6868 6.2673
dipole: 6.9350
quadrupole: -109.2739 -90.2859 -99.8043
quadrupole: -5.1675 -1.4539 -3.2584
quadrupole: -9.4858 9.5021 -0.0163 -5.1675 -1.4539 -3.2584
hfenergy: -1082.3062541 hartree
pointgroup: C01 [X(C9H12N2O3S1)]
dipole: -1.183951 -0.502335 -2.4063169 debye
polarizability: 202.1537437|-3.7772536|138.3209486|-10.7136019|4.5558072|103.6382082 unknown
InChI: InChI=1S/C9H12N2O3S/c1-7(12)11-6-8-2-4-9(5-3-8)15(10,13)14/h2-5,11H,6,10H2,1H3
charge 0 multiplicity 1
27 atoms
S  3.616127 0.443973 -0.051425
O  3.791503 1.824133 0.795771
O  4.530195 -0.883356 0.187611
O  -4.332315 0.499698 1.290713
N  -3.224726 -0.501231 -0.493016
N  3.820949 0.898243 -1.827746
C  -0.858983 -0.858627 0.242029
C  1.811358 -0.077057 0.057157
C  -2.318766 -1.28261 0.363976
C  -0.496539 0.501338 0.431637
C  0.149678 -1.816162 -0.027275
C  0.850606 0.907573 0.341962
C  1.506656 -1.433345 -0.123938
C  -4.193325 0.343309 0.039422
C  -5.072733 1.060747 -0.978732
H  -2.421987 -2.360482 0.136644
H  -2.6824 -1.116885 1.396499
H  -1.273758 1.238058 0.661784
H  -0.121568 -2.869891 -0.161091
H  1.15311 1.945257 0.514499
H  2.302309 -2.161279 -0.311323
H  -3.123617 -0.574239 -1.506386
H  4.083156 1.897696 -1.86811
H  4.541232 0.27511 -2.230472
H  -6.12626 0.784984 -0.799493
H  -4.991255 2.150078 -0.822794
H  -4.816849 0.828366 -2.026903
