program: Orca
programVersion: 5.0.2
elementType: S O O O O C C C C C C C C C C C C C C C C C C C C C C C H H H H H H H H H H H H H H H H H H H H H H H H
charge: 0
multiplicity: 1
keywords: wb97x-d3
keywords: def2-TZVPP
keywords: def2/J RIJCOSX
keywords: DEFGRID2
keywords: scfconv7
keywords: smallprint printgap noloewdin
keywords: NOSOSCF
formula: C23H24O4S
InChI: InChI=1/C23H24O4S/c1-23(2)19(12-17-8-9-28-22(17)25)20(23)21(24)27-14-16-11-18(26-13-16)10-15-6-4-3-5-7-15/h3-7,11-13,19-20H,8-10,14H2,1-2H3
52 atoms
S  -0.051228 0.375935 -3.832654
O  1.868088 0.927054 0.872832
O  3.860835 1.858917 1.234252
O  -0.955803 -1.028742 -1.805247
O  -1.865098 2.08397 -0.988354
C  3.352747 -1.750496 1.216194
C  3.085783 -1.488287 -0.224042
C  3.77642 -0.418125 0.61268
C  2.213799 -1.834941 2.201604
C  4.493805 -2.679847 1.555665
C  1.717205 -1.343646 -0.766052
C  3.185365 0.892952 0.944308
C  1.413623 -0.596391 -1.829004
C  2.328093 0.309181 -2.587389
C  0.023167 -0.539206 -2.322871
C  1.759849 0.475069 -3.994695
C  1.189099 2.186955 1.010251
C  -0.162058 2.001027 0.428831
C  -1.242715 1.219892 0.954734
C  -0.596966 2.489899 -0.753978
C  -2.249768 1.302641 0.054204
C  -3.616276 0.719638 -0.020497
C  -3.898287 -0.195354 1.138739
C  -4.71904 0.213106 2.184242
C  -3.330107 -1.466895 1.187916
C  -4.97256 -0.630788 3.258598
C  -3.578711 -2.310895 2.260263
C  -4.402156 -1.894958 3.299643
H  3.770202 -1.955837 -0.92865
H  4.842759 -0.327749 0.44231
H  1.87585 -2.870075 2.276137
H  2.546257 -1.527354 3.194197
H  1.347336 -1.232806 1.94036
H  4.149981 -3.715649 1.570294
H  5.304746 -2.608122 0.83024
H  4.903059 -2.451174 2.540991
H  0.927561 -1.916683 -0.289133
H  3.349723 -0.067545 -2.633239
H  2.360465 1.283484 -2.08925
H  2.092129 -0.321725 -4.658283
H  2.025611 1.430737 -4.440044
H  1.143369 2.457493 2.066743
H  1.73006 2.970194 0.477573
H  -1.250913 0.669104 1.881989
H  -0.138088 3.122601 -1.497583
H  -4.358895 1.521978 -0.050666
H  -3.719551 0.171148 -0.962205
H  -5.168112 1.19883 2.157077
H  -2.686497 -1.797655 0.381129
H  -5.617535 -0.299138 4.062034
H  -3.130863 -3.296038 2.283747
H  -4.598914 -2.554652 4.134684
elementType: S O C H
totalener: -1590.09370573 hartree
nucrepener: 2840.96116528 hartree
electener: -4431.05487101 hartree
oneelecener: -7823.03938323 hartree
twoeener: 3391.98451222 hartree
cpcmener: -0.04538170 hartree
kineticenergy: 1584.21713638 hartree
xcener: -135.010074107724 hartree
chargesum: 0.0000000
charge: -0.062143 -0.254279 -0.507171 -0.463958 -0.283919 0.111730 -0.036502 -0.134310 -0.279316 -0.267377 -0.086052 0.444749 -0.112005 -0.117722 0.306716 -0.119311 0.053780 -0.092745 -0.272899 -0.036760 0.154151 -0.011348 0.013695 -0.183968 -0.214208 -0.159846 -0.159264 -0.170851 0.119758 0.097240 0.101449 0.104445 0.085961 0.094512 0.089890 0.098288 0.136025 0.104544 0.101013 0.119054 0.121585 0.127000 0.113449 0.160217 0.177717 0.106778 0.110675 0.141737 0.148466 0.160122 0.159826 0.161385
qa: -0.0621 -0.2543 -0.5072 -0.4640 -0.2839 0.1117 -0.0365 -0.1343 -0.2793 -0.2674 -0.0861 0.4447 -0.1120 -0.1177 0.3067 -0.1193 0.0538 -0.0927 -0.2729 -0.0368 0.1542 -0.0113 0.0137 -0.1840 -0.2142 -0.1598 -0.1593 -0.1709 0.1198 0.0972 0.1014 0.1044 0.0860 0.0945 0.0899 0.0983 0.1360 0.1045 0.1010 0.1191 0.1216 0.1270 0.1134 0.1602 0.1777 0.1068 0.1107 0.1417 0.1485 0.1601 0.1598 0.1614
va: 2.4364 2.1162 1.9910 2.0122 2.2427 3.7718 3.8414 3.9071 3.9105 3.9076 3.8038 4.0743 3.5499 3.9743 4.1113 3.9580 3.8559 3.7378 3.9340 3.8953 3.6581 3.8005 3.5986 3.9396 3.9089 3.8913 3.9080 3.8912 1.0059 1.0285 0.9993 1.0009 1.0068 1.0020 1.0046 1.0012 1.0066 1.0058 1.0103 1.0070 1.0066 0.9914 1.0077 1.0031 0.9980 1.0120 1.0117 1.0039 1.0133 0.9898 0.9915 0.9890
dispcorr: -0.031442299 hartree
energy: -1590.125148031002
dipole: 10.68692 -9.08621 1.60071 -11.16023 10.57540 -0.58483 12.19129 -12.50377 -0.31248
magnitude: 1.73261 au
magnitude: 4.40394 debye
