program: Orca
programVersion: 5.0.2
elementType: S O O O O C C C C C C C C C C C C C C C C C C C C C C C H H H H H H H H H H H H H H H H H H H H H H H H
charge: 0
multiplicity: 1
keywords: wb97x-d3
keywords: def2-TZVPP
keywords: def2/J RIJCOSX
keywords: DEFGRID2
keywords: scfconv7
keywords: smallprint printgap noloewdin
keywords: NOSOSCF
formula: C23H24O4S
InChI: InChI=1/C23H24O4S/c1-23(2)19(12-17-8-9-28-22(17)25)20(23)21(24)27-14-16-11-18(26-13-16)10-15-6-4-3-5-7-15/h3-7,11-13,19-20H,8-10,14H2,1-2H3
52 atoms
S  0.077973 1.412615 -3.771197
O  2.246419 1.40382 0.639072
O  1.862406 0.401438 2.605026
O  -1.133705 -0.498859 -2.438713
O  -1.850112 2.385633 -0.691485
C  2.621039 -2.168376 0.982457
C  2.57841 -1.459388 -0.350009
C  3.080041 -0.748852 0.896701
C  1.324978 -2.517576 1.674234
C  3.69458 -3.214017 1.161773
C  1.306338 -1.070582 -0.984468
C  2.321663 0.386869 1.487749
C  1.228493 -0.248101 -2.03499
C  2.352583 0.464529 -2.71586
C  -0.081656 0.06712 -2.638166
C  1.789223 1.771422 -3.267828
C  1.409875 2.530999 0.964088
C  0.022117 2.274876 0.498169
C  -0.893982 1.277888 0.972822
C  -0.612431 2.905594 -0.51574
C  -2.00801 1.384713 0.212755
C  -3.295141 0.63792 0.196315
C  -3.233584 -0.536404 1.134233
C  -3.696505 -0.42506 2.441185
C  -2.659728 -1.737849 0.725015
C  -3.591302 -1.493017 3.323355
C  -2.553195 -2.807023 1.603424
C  -3.019076 -2.687144 2.906885
H  3.368658 -1.704149 -1.053012
H  4.153441 -0.577046 0.919388
H  0.538339 -1.773576 1.555739
H  0.941093 -3.461744 1.283921
H  1.489085 -2.647966 2.74463
H  3.361031 -4.180197 0.779582
H  4.61229 -2.946427 0.636227
H  3.940495 -3.340559 2.217619
H  0.383781 -1.475934 -0.579967
H  2.735685 -0.14534 -3.538467
H  3.186143 0.667021 -2.044094
H  2.345342 2.135997 -4.12793
H  1.769767 2.550882 -2.506651
H  1.454378 2.743964 2.032114
H  1.844219 3.376193 0.433539
H  -0.739575 0.575355 1.775352
H  -0.326801 3.718371 -1.165169
H  -4.116357 1.303066 0.478685
H  -3.507226 0.299474 -0.821768
H  -4.142669 0.505206 2.772741
H  -2.290112 -1.837626 -0.288407
H  -3.957025 -1.390735 4.336911
H  -2.105685 -3.734182 1.268838
H  -2.937378 -3.520032 3.593057
elementType: S O C H
totalener: -1590.09370467 hartree
nucrepener: 2928.47279522 hartree
electener: -4518.56649988 hartree
oneelecener: -7998.43729983 hartree
twoeener: 3479.87079995 hartree
cpcmener: -0.04378638 hartree
kineticenergy: 1584.20619041 hartree
xcener: -135.009135639395 hartree
chargesum: 0.0000000
charge: -0.061592 -0.271664 -0.470531 -0.458728 -0.285107 0.116470 -0.057446 -0.094787 -0.272632 -0.265353 -0.072251 0.406962 -0.107481 -0.151728 0.286973 -0.119083 0.066252 -0.090941 -0.277431 -0.044906 0.161732 -0.008692 0.034626 -0.184689 -0.210526 -0.162424 -0.193123 -0.150601 0.115958 0.113263 0.043887 0.108666 0.107441 0.094498 0.090081 0.097189 0.131503 0.115575 0.094466 0.131738 0.111823 0.130867 0.123122 0.161048 0.177021 0.109079 0.107527 0.142043 0.149502 0.159800 0.161355 0.161248
qa: -0.0616 -0.2717 -0.4705 -0.4587 -0.2851 0.1165 -0.0574 -0.0948 -0.2726 -0.2654 -0.0723 0.4070 -0.1075 -0.1517 0.2870 -0.1191 0.0663 -0.0909 -0.2774 -0.0449 0.1617 -0.0087 0.0346 -0.1847 -0.2105 -0.1624 -0.1931 -0.1506 0.1160 0.1133 0.0439 0.1087 0.1074 0.0945 0.0901 0.0972 0.1315 0.1156 0.0945 0.1317 0.1118 0.1309 0.1231 0.1610 0.1770 0.1091 0.1075 0.1420 0.1495 0.1598 0.1614 0.1612
va: 2.4293 2.1208 2.0174 2.0270 2.2450 3.8365 3.8234 3.8695 3.9183 3.8882 3.7934 4.1457 3.4886 3.9913 4.1437 3.9343 3.8108 3.6690 3.9039 3.9296 3.6722 3.8146 3.5725 3.9368 3.8578 3.8986 3.8991 3.8736 1.0020 1.0144 0.9966 1.0010 1.0068 1.0022 1.0036 1.0019 0.9955 1.0052 1.0150 1.0107 1.0059 1.0088 1.0001 1.0084 0.9956 1.0088 1.0149 1.0035 1.0197 0.9896 0.9913 0.9881
dispcorr: -0.035168462 hartree
energy: -1590.128873129075
dipole: 10.72796 -7.93680 2.79116 -13.94802 14.45669 0.50867 10.38571 -10.76215 -0.37645
magnitude: 2.86200 au
magnitude: 7.27462 debye
