program: Orca
programVersion: 5.0.2
elementType: S O O O O C C C C C C C C C C C C C C C C C C C C C C C H H H H H H H H H H H H H H H H H H H H H H H H
charge: 0
multiplicity: 1
keywords: wb97x-d3
keywords: def2-TZVPP
keywords: def2/J RIJCOSX
keywords: DEFGRID2
keywords: scfconv7
keywords: smallprint printgap noloewdin
keywords: NOSOSCF
formula: C23H24O4S
InChI: InChI=1/C23H24O4S/c1-23(2)19(12-17-8-9-28-22(17)25)20(23)21(24)27-14-16-11-18(26-13-16)10-15-6-4-3-5-7-15/h3-7,11-13,19-20H,8-10,14H2,1-2H3
52 atoms
S  -1.257592 -4.022911 0.758562
O  2.37008 2.788823 -0.562726
O  2.72307 1.434919 1.178242
O  -0.664345 -1.799803 2.023844
O  -1.310478 2.714295 1.804327
C  3.675271 -0.681671 -0.872314
C  2.18155 -0.723161 -1.085516
C  2.936187 0.609824 -1.072578
C  4.260044 -1.095497 0.455487
C  4.520326 -1.118609 -2.045511
C  1.268168 -1.118474 -0.011204
C  2.682654 1.613177 -0.017336
C  0.379935 -2.113987 -0.124517
C  0.13349 -2.99785 -1.306315
C  -0.48278 -2.456918 1.022948
C  -0.346979 -4.350708 -0.78273
C  1.844396 3.810251 0.306177
C  0.448052 3.471792 0.683488
C  -0.688505 3.454557 -0.187851
C  0.006375 3.010163 1.876195
C  -1.726646 2.982022 0.539432
C  -3.121921 2.617418 0.181765
C  -3.206412 1.171515 -0.250095
C  -3.650227 0.18394 0.622891
C  -2.794357 0.803416 -1.528854
C  -3.689676 -1.146283 0.222578
C  -2.836808 -0.52261 -1.932561
C  -3.285715 -1.502979 -1.055866
H  1.868589 -1.019744 -2.079765
H  3.033439 1.048796 -2.058687
H  3.636619 -0.866361 1.313913
H  4.424002 -2.174382 0.449236
H  5.229263 -0.618461 0.609776
H  5.512082 -0.665706 -1.994585
H  4.647999 -2.202349 -2.042958
H  4.071796 -0.83674 -2.998638
H  1.327051 -0.598601 0.938172
H  1.023376 -3.135497 -1.918787
H  -0.636929 -2.555285 -1.942855
H  0.488495 -5.012039 -0.559262
H  -1.008419 -4.853025 -1.484623
H  2.481503 3.947341 1.180045
H  1.887049 4.720455 -0.288907
H  -0.717798 3.74539 -1.226483
H  0.491793 2.853913 2.826807
H  -3.789528 2.799442 1.026342
H  -3.449015 3.26698 -0.631365
H  -3.971279 0.455341 1.621585
H  -2.439857 1.563891 -2.215314
H  -4.035629 -1.905643 0.911836
H  -2.520611 -0.791428 -2.932428
H  -3.318008 -2.538632 -1.367909
elementType: S O C H
totalener: -1590.09565845 hartree
nucrepener: 2847.00911658 hartree
electener: -4437.10477503 hartree
oneelecener: -7836.12148267 hartree
twoeener: 3399.01670764 hartree
cpcmener: -0.04954546 hartree
kineticenergy: 1584.21871962 hartree
xcener: -135.010801962838 hartree
chargesum: 0.0000000
charge: -0.063298 -0.290346 -0.484493 -0.465647 -0.282322 0.140990 0.009808 -0.118344 -0.279007 -0.263445 -0.138220 0.416532 -0.127887 -0.140588 0.291327 -0.121328 0.095431 -0.074325 -0.350617 -0.027251 0.212591 -0.053270 0.053711 -0.206127 -0.194458 -0.143474 -0.180183 -0.171408 0.116892 0.104817 0.097815 0.097782 0.104901 0.097216 0.095785 0.091586 0.123577 0.104689 0.109777 0.122853 0.121666 0.119200 0.123276 0.164258 0.176252 0.107584 0.116955 0.141535 0.145752 0.155613 0.158875 0.156992
qa: -0.0633 -0.2903 -0.4845 -0.4656 -0.2823 0.1410 0.0098 -0.1183 -0.2790 -0.2634 -0.1382 0.4165 -0.1279 -0.1406 0.2913 -0.1213 0.0954 -0.0743 -0.3506 -0.0273 0.2126 -0.0533 0.0537 -0.2061 -0.1945 -0.1435 -0.1802 -0.1714 0.1169 0.1048 0.0978 0.0978 0.1049 0.0972 0.0958 0.0916 0.1236 0.1047 0.1098 0.1229 0.1217 0.1192 0.1233 0.1643 0.1763 0.1076 0.1170 0.1415 0.1458 0.1556 0.1589 0.1570
va: 2.4320 2.1181 2.0076 2.0059 2.2629 3.7290 3.8083 3.9482 3.8955 3.9068 3.8287 4.0951 3.5810 3.9758 4.1646 3.9412 3.8282 3.6342 4.0007 3.9443 3.6167 3.8153 3.5813 3.9622 3.9127 3.8112 3.8871 3.8192 1.0050 1.0276 1.0130 1.0017 0.9995 1.0019 1.0025 1.0042 1.0371 1.0097 1.0074 1.0085 1.0082 1.0089 0.9924 1.0074 0.9995 1.0156 1.0068 1.0048 1.0019 0.9966 0.9921 0.9922
dispcorr: -0.030610017 hartree
energy: -1590.126268466148
dipole: 13.09822 -11.97399 1.12423 -4.54363 4.29689 -0.24673 -14.13028 10.45841 -3.67187
magnitude: 3.84804 au
magnitude: 9.78094 debye
