program: Orca
programVersion: 5.0.2
elementType: S O O O O C C C C C C C C C C C C C C C C C C C C C C C H H H H H H H H H H H H H H H H H H H H H H H H
charge: 0
multiplicity: 1
keywords: wb97x-d3
keywords: def2-TZVPP
keywords: def2/J RIJCOSX
keywords: DEFGRID2
keywords: scfconv7
keywords: smallprint printgap noloewdin
keywords: NOSOSCF
formula: C23H24O4S
InChI: InChI=1/C23H24O4S/c1-23(2)19(12-17-8-9-28-22(17)25)20(23)21(24)27-14-16-11-18(26-13-16)10-15-6-4-3-5-7-15/h3-7,11-13,19-20H,8-10,14H2,1-2H3
52 atoms
S  -0.790414 -2.953442 0.780286
O  2.417786 1.635556 0.054298
O  2.315805 1.606724 -2.176694
O  0.537465 -1.598476 2.598724
O  -1.755269 0.641549 1.119064
C  4.926878 0.010922 -0.012699
C  3.828777 -0.985684 -0.186124
C  3.911353 0.240848 -1.109818
C  5.025937 0.88525 1.214258
C  6.28706 -0.407652 -0.524432
C  2.701085 -1.132145 0.749902
C  2.8147 1.227536 -1.138498
C  1.631115 -1.884856 0.473058
C  1.380482 -2.663213 -0.779541
C  0.547864 -2.02346 1.46535
C  -0.125863 -2.879257 -0.911191
C  1.25697 2.477138 0.170729
C  0.013563 1.668633 0.256373
C  -0.718822 1.030924 -0.799765
C  -0.664297 1.38752 1.39355
C  -1.782749 0.426549 -0.220987
C  -2.949829 -0.312803 -0.767405
C  -4.219875 0.492396 -0.636253
C  -4.979893 0.434951 0.528789
C  -4.624055 1.34343 -1.660713
C  -6.119401 1.21582 0.668592
C  -5.765484 2.121954 -1.525691
C  -6.514898 2.063103 -0.357899
H  4.092919 -1.902811 -0.704063
H  4.257048 0.014956 -2.11135
H  5.698556 0.412203 1.931248
H  5.455373 1.854181 0.956508
H  4.086058 1.066772 1.725725
H  6.824983 -0.970071 0.240356
H  6.213623 -1.03678 -1.41196
H  6.888391 0.465681 -0.782074
H  2.746371 -0.624051 1.706791
H  1.887097 -3.630249 -0.721212
H  1.760692 -2.150366 -1.663346
H  -0.367431 -3.803999 -1.429635
H  -0.605233 -2.052408 -1.433484
H  1.40928 3.03254 1.094294
H  1.221137 3.193304 -0.649777
H  -0.492765 1.03816 -1.853975
H  -0.498721 1.651246 2.426662
H  -2.746864 -0.531387 -1.816347
H  -3.05927 -1.272091 -0.254043
H  -4.6820 -0.229133 1.33147
H  -4.040591 1.396158 -2.572408
H  -6.700174 1.160884 1.580285
H  -6.069937 2.775149 -2.333337
H  -7.403937 2.670711 -0.250241
elementType: S O C H
totalener: -1590.09380362 hartree
nucrepener: 2819.84426003 hartree
electener: -4409.93806365 hartree
oneelecener: -7780.55762525 hartree
twoeener: 3370.61956160 hartree
cpcmener: -0.04560698 hartree
kineticenergy: 1584.22436642 hartree
xcener: -135.012026365941 hartree
chargesum: -0.0000000
charge: -0.072277 -0.262515 -0.501795 -0.458710 -0.283691 0.135120 -0.079570 -0.096548 -0.274254 -0.265482 -0.068633 0.427964 -0.127149 -0.140218 0.310203 -0.124113 0.050654 -0.044682 -0.325285 -0.044145 0.198209 -0.033278 0.053785 -0.214476 -0.207965 -0.162334 -0.159905 -0.172707 0.119490 0.096118 0.096532 0.106267 0.088848 0.095948 0.090130 0.098892 0.128342 0.114677 0.097170 0.132037 0.115961 0.113634 0.126212 0.155831 0.177497 0.114945 0.109708 0.141741 0.143122 0.159252 0.160291 0.161152
qa: -0.0723 -0.2625 -0.5018 -0.4587 -0.2837 0.1351 -0.0796 -0.0965 -0.2743 -0.2655 -0.0686 0.4280 -0.1271 -0.1402 0.3102 -0.1241 0.0507 -0.0447 -0.3253 -0.0441 0.1982 -0.0333 0.0538 -0.2145 -0.2080 -0.1623 -0.1599 -0.1727 0.1195 0.0961 0.0965 0.1063 0.0888 0.0959 0.0901 0.0989 0.1283 0.1147 0.0972 0.1320 0.1160 0.1136 0.1262 0.1558 0.1775 0.1149 0.1097 0.1417 0.1431 0.1593 0.1603 0.1612
va: 2.4251 2.1184 1.9928 2.0221 2.2475 3.7883 3.8517 3.8817 3.8882 3.8979 3.7753 4.1109 3.5467 3.9982 4.1354 3.9474 3.8473 3.5762 3.9789 3.9236 3.5739 3.7422 3.5932 3.9563 3.9467 3.8997 3.8943 3.8907 1.0035 1.0288 1.0008 0.9999 1.0147 1.0024 1.0042 1.0012 1.0272 1.0022 1.0071 1.0085 1.0081 1.0025 1.0066 1.0234 0.9948 1.0105 1.0181 1.0104 1.0047 0.9905 0.9902 0.9894
dispcorr: -0.031139202 hartree
energy: -1590.124942822919
dipole: 15.12774 -13.62691 1.50082 2.41584 -2.97191 -0.55607 -6.49939 5.03690 -1.46249
magnitude: 2.16808 au
magnitude: 5.51081 debye
