program: Orca
programVersion: 5.0.2
elementType: S O O O O C C C C C C C C C C C C C C C C C C C C C C C H H H H H H H H H H H H H H H H H H H H H H H H
charge: 0
multiplicity: 1
keywords: wb97x-d3
keywords: def2-TZVPP
keywords: def2/J RIJCOSX
keywords: DEFGRID2
keywords: scfconv7
keywords: smallprint printgap noloewdin
keywords: NOSOSCF
formula: C23H24O4S
InChI: InChI=1/C23H24O4S/c1-23(2)19(12-17-8-9-28-22(17)25)20(23)21(24)27-14-16-11-18(26-13-16)10-15-6-4-3-5-7-15/h3-7,11-13,19-20H,8-10,14H2,1-2H3
52 atoms
S  -1.385215 -2.239409 1.770821
O  2.523226 1.297396 0.414581
O  2.142477 2.249714 -1.568385
O  0.926639 -1.860091 2.957634
O  -1.634015 1.422985 1.687531
C  4.245087 -0.749526 -1.064959
C  2.872155 -1.302883 -0.909113
C  3.062131 0.082073 -1.530458
C  5.066499 -0.360476 0.138514
C  5.084734 -1.315566 -2.186323
C  2.228659 -1.496084 0.404651
C  2.541884 1.313408 -0.907944
C  0.910629 -1.646774 0.556925
C  -0.137404 -1.526326 -0.500887
C  0.341221 -1.891139 1.89774
C  -1.360936 -2.318395 -0.046794
C  1.853122 2.3615 1.117747
C  0.379438 2.159768 1.109819
C  -0.581928 2.626722 0.154853
C  -0.323945 1.435001 2.012117
C  -1.785995 2.154248 0.553762
C  -3.150478 2.252259 -0.023198
C  -3.556208 1.001324 -0.768755
C  -2.941648 0.681824 -1.9780
C  -4.542048 0.154857 -0.2741
C  -3.313621 -0.451767 -2.684553
C  -4.918466 -0.982524 -0.980278
C  -4.308352 -1.287013 -2.188476
H  2.56172 -2.035308 -1.650111
H  2.931315 0.110294 -2.605574
H  5.774021 0.426573 -0.126296
H  4.486677 -0.01122 0.987847
H  5.646238 -1.222739 0.472545
H  5.823865 -0.588087 -2.525653
H  5.621335 -2.203536 -1.847651
H  4.47662 -1.601078 -3.045316
H  2.865146 -1.560823 1.281317
H  0.203551 -1.883974 -1.472666
H  -0.404011 -0.470963 -0.622331
H  -1.296416 -3.362905 -0.347627
H  -2.290347 -1.904713 -0.429928
H  2.244418 2.302094 2.131196
H  2.13305 3.330285 0.704689
H  -0.40003 3.244925 -0.709579
H  -0.036545 0.914208 2.912361
H  -3.877119 2.467853 0.763312
H  -3.16118 3.103955 -0.705527
H  -2.16846 1.330994 -2.373067
H  -5.027868 0.390342 0.665405
H  -2.829918 -0.682268 -3.625092
H  -5.690578 -1.629401 -0.583992
H  -4.60245 -2.170625 -2.739821
elementType: S O C H
totalener: -1590.09438392 hartree
nucrepener: 2899.83626628 hartree
electener: -4489.93065019 hartree
oneelecener: -7940.11885958 hartree
twoeener: 3450.18820939 hartree
cpcmener: -0.04133827 hartree
kineticenergy: 1584.21989071 hartree
xcener: -135.012913689537 hartree
chargesum: -0.0000000
charge: -0.064100 -0.265480 -0.503652 -0.462700 -0.274032 0.118472 -0.052391 -0.115227 -0.287935 -0.265289 -0.045040 0.435447 -0.156697 -0.102788 0.287077 -0.062211 0.049152 -0.070223 -0.287452 -0.051205 0.187374 -0.057598 0.061929 -0.230275 -0.207482 -0.151694 -0.130807 -0.170240 0.120110 0.095370 0.104026 0.093536 0.101369 0.098030 0.096125 0.089724 0.129818 0.107838 0.082280 0.130312 0.054782 0.117821 0.126715 0.158925 0.179050 0.108073 0.119469 0.146189 0.142039 0.158900 0.157641 0.156924
qa: -0.0641 -0.2655 -0.5037 -0.4627 -0.2740 0.1185 -0.0524 -0.1152 -0.2879 -0.2653 -0.0450 0.4354 -0.1567 -0.1028 0.2871 -0.0622 0.0492 -0.0702 -0.2875 -0.0512 0.1874 -0.0576 0.0619 -0.2303 -0.2075 -0.1517 -0.1308 -0.1702 0.1201 0.0954 0.1040 0.0935 0.1014 0.0980 0.0961 0.0897 0.1298 0.1078 0.0823 0.1303 0.0548 0.1178 0.1267 0.1589 0.1790 0.1081 0.1195 0.1462 0.1420 0.1589 0.1576 0.1569
va: 2.4481 2.1191 1.9940 2.0181 2.2597 3.7787 3.8333 3.8867 3.8982 3.9021 3.7633 4.0911 3.5818 3.9819 4.1627 3.9631 3.8439 3.6319 3.9836 3.9384 3.6540 3.8047 3.5504 3.8781 3.9258 3.8512 3.8400 3.8539 1.0051 1.0287 1.0001 1.0119 0.9988 1.0018 1.0018 1.0053 1.0178 1.0104 1.0187 1.0093 1.0338 1.0008 1.0040 1.0176 1.0021 1.0126 1.0055 1.0055 1.0040 0.9916 0.9905 0.9915
dispcorr: -0.033935191 hartree
energy: -1590.128319106845
dipole: 12.05413 -11.86000 0.19413 -2.51149 2.04634 -0.46515 -14.51944 12.53344 -1.98600
magnitude: 2.04896 au
magnitude: 5.20805 debye
