program: Orca
programVersion: 5.0.2
elementType: S O O O O C C C C C C C C C C C C C C C C C C C C C C C H H H H H H H H H H H H H H H H H H H H H H H H
charge: 0
multiplicity: 1
keywords: wb97x-d3
keywords: def2-TZVPP
keywords: def2/J RIJCOSX
keywords: DEFGRID2
keywords: scfconv7
keywords: smallprint printgap noloewdin
keywords: NOSOSCF
formula: C23H24O4S
InChI: InChI=1/C23H24O4S/c1-23(2)19(12-17-8-9-28-22(17)25)20(23)21(24)27-14-16-11-18(26-13-16)10-15-6-4-3-5-7-15/h3-7,11-13,19-20H,8-10,14H2,1-2H3
52 atoms
S  -1.534985 -2.105348 1.079124
O  2.52962 1.17696 0.618164
O  2.751511 2.359861 -1.261928
O  0.596576 -2.14377 2.606707
O  -1.491577 2.792202 -0.175964
C  4.537845 -0.780095 -0.685136
C  3.152655 -1.306777 -0.821418
C  3.460935 0.116938 -1.275086
C  5.126499 -0.509674 0.676858
C  5.562005 -1.270342 -1.681094
C  2.293952 -1.602619 0.342363
C  2.891896 1.323691 -0.646413
C  0.961099 -1.63578 0.280783
C  0.107406 -1.275216 -0.890867
C  0.173732 -1.979004 1.482284
C  -1.260253 -1.933042 -0.710305
C  1.835405 2.262954 1.262006
C  0.398871 2.298124 0.875458
C  -0.679017 1.571102 1.480093
C  -0.160835 3.01342 -0.12896
C  -1.806038 1.910211 0.809947
C  -3.240001 1.558611 0.99059
C  -3.808103 0.601991 -0.033313
C  -4.402762 -0.584678 0.386662
C  -3.777984 0.882878 -1.398593
C  -4.939778 -1.479251 -0.530005
C  -4.31344 -0.009745 -2.317747
C  -4.893119 -1.196399 -1.88781
H  2.971207 -1.966841 -1.666569
H  3.528531 0.241569 -2.349253
H  5.610059 -1.415403 1.047425
H  5.891158 0.265888 0.612274
H  4.403014 -0.198841 1.425942
H  6.01948 -2.196958 -1.329813
H  5.117441 -1.467399 -2.657194
H  6.358108 -0.536451 -1.816368
H  2.779167 -1.843297 1.282975
H  0.549661 -1.582809 -1.838648
H  -0.009091 -0.187257 -0.92865
H  -1.290479 -2.924278 -1.159955
H  -2.06381 -1.336629 -1.135006
H  1.939134 2.056536 2.32531
H  2.333007 3.210015 1.053324
H  -0.616445 0.901619 2.323626
H  0.239155 3.708105 -0.850346
H  -3.346197 1.12074 1.983375
H  -3.83349 2.478348 0.996193
H  -4.443527 -0.814515 1.444232
H  -3.340028 1.805867 -1.756903
H  -5.393466 -2.397816 -0.180631
H  -4.27919 0.225121 -3.373871
H  -5.308518 -1.891933 -2.605361
elementType: S O C H
totalener: -1590.09217421 hartree
nucrepener: 2884.94716118 hartree
electener: -4475.03933539 hartree
oneelecener: -7910.12651578 hartree
twoeener: 3435.08718039 hartree
cpcmener: -0.03934288 hartree
kineticenergy: 1584.21784886 hartree
xcener: -135.015700466546 hartree
chargesum: -0.0000000
charge: -0.061147 -0.265870 -0.502497 -0.470366 -0.287095 0.113973 -0.042212 -0.124762 -0.289257 -0.267176 -0.050077 0.433862 -0.147725 -0.112054 0.293943 -0.087652 0.055350 -0.050758 -0.387937 -0.011538 0.269257 -0.072824 0.061163 -0.242676 -0.216330 -0.125590 -0.128583 -0.187291 0.119685 0.095413 0.102212 0.103578 0.094091 0.095673 0.090014 0.098106 0.129413 0.107842 0.098577 0.134618 0.076957 0.117565 0.128026 0.159764 0.169000 0.104514 0.118818 0.145243 0.137972 0.158785 0.158998 0.159005
qa: -0.0611 -0.2659 -0.5025 -0.4704 -0.2871 0.1140 -0.0422 -0.1248 -0.2893 -0.2672 -0.0501 0.4339 -0.1477 -0.1121 0.2939 -0.0877 0.0554 -0.0508 -0.3879 -0.0115 0.2693 -0.0728 0.0612 -0.2427 -0.2163 -0.1256 -0.1286 -0.1873 0.1197 0.0954 0.1022 0.1036 0.0941 0.0957 0.0900 0.0981 0.1294 0.1078 0.0986 0.1346 0.0770 0.1176 0.1280 0.1598 0.1690 0.1045 0.1188 0.1452 0.1380 0.1588 0.1590 0.1590
va: 2.4574 2.1148 1.9941 2.0110 2.2666 3.7753 3.8355 3.8996 3.9027 3.9043 3.7724 4.0879 3.5496 4.0244 4.1740 3.9712 3.8111 3.5982 3.9881 3.9494 3.5231 3.8136 3.5559 3.8727 3.9220 3.8456 3.8574 3.8999 1.0052 1.0292 0.9983 1.0006 1.0108 1.0017 1.0047 1.0016 1.0170 1.0083 1.0023 1.0066 1.0279 0.9987 1.0068 1.0101 1.0067 1.0121 1.0024 1.0074 1.0226 0.9909 0.9908 0.9912
dispcorr: -0.033844433 hartree
energy: -1590.126018646285
dipole: 12.98432 -12.77704 0.20728 -4.01218 3.52290 -0.48928 -8.64250 7.19381 -1.44869
magnitude: 1.54307 au
magnitude: 3.92217 debye
