program: Orca
programVersion: 5.0.2
elementType: S O O O O C C C C C C C C C C C C C C C C C C C C C C C H H H H H H H H H H H H H H H H H H H H H H H H
charge: 0
multiplicity: 1
keywords: wb97x-d3
keywords: def2-TZVPP
keywords: def2/J RIJCOSX
keywords: DEFGRID2
keywords: scfconv7
keywords: smallprint printgap noloewdin
keywords: NOSOSCF
formula: C23H24O4S
InChI: InChI=1/C23H24O4S/c1-23(2)19(12-17-8-9-28-22(17)25)20(23)21(24)27-14-16-11-18(26-13-16)10-15-6-4-3-5-7-15/h3-7,11-13,19-20H,8-10,14H2,1-2H3
52 atoms
S  -1.210583 -2.285464 1.307863
O  1.918209 1.806825 -1.368895
O  3.043576 1.624572 0.553916
O  0.906903 -1.856452 2.820771
O  -1.057467 1.674628 1.918164
C  4.710132 -0.605241 -0.733275
C  3.366445 -1.255993 -0.736664
C  3.536105 0.160795 -1.286432
C  5.382815 -0.228811 0.565501
C  5.692979 -1.093009 -1.774218
C  2.563946 -1.483724 0.483768
C  2.845635 1.264701 -0.57498
C  1.240757 -1.642434 0.448482
C  0.357161 -1.539033 -0.75124
C  0.486128 -1.89334 1.701801
C  -0.914042 -2.34538 -0.483105
C  1.100493 2.835402 -0.795302
C  0.040484 2.296173 0.098387
C  -1.251869 1.802866 -0.278288
C  0.093137 2.18089 1.446252
C  -1.875675 1.444407 0.870045
C  -3.231752 0.920419 1.194945
C  -4.012521 0.53472 -0.031075
C  -4.470648 1.505272 -0.918278
C  -4.300578 -0.798546 -0.298865
C  -5.184119 1.150025 -2.052364
C  -5.018786 -1.158505 -1.430759
C  -5.458808 -0.185162 -2.31387
H  3.194773 -1.996458 -1.514417
H  3.4772 0.237529 -2.366595
H  4.695379 0.058177 1.354211
H  5.976558 -1.073675 0.919141
H  6.062398 0.610136 0.411231
H  5.201711 -1.368879 -2.708593
H  6.429981 -0.321646 -2.003124
H  6.230446 -1.970921 -1.412203
H  3.065949 -1.537941 1.443553
H  0.844191 -1.886424 -1.663407
H  0.094681 -0.489523 -0.90635
H  -0.799019 -3.386059 -0.785221
H  -1.776098 -1.927489 -1.000492
H  1.722555 3.558697 -0.266198
H  0.656603 3.338683 -1.653297
H  -1.659047 1.736716 -1.274525
H  0.86555 2.396376 2.165344
H  -3.129974 0.057407 1.857166
H  -3.784908 1.677612 1.761997
H  -4.26768 2.550737 -0.7174
H  -3.968711 -1.562559 0.394243
H  -5.532571 1.917889 -2.730687
H  -5.239255 -2.2016 -1.617231
H  -6.020084 -0.463125 -3.196177
totalener: -1590.07627360 hartree
nucrepener: 2850.97219579 hartree
electener: -4441.04846939 hartree
oneelecener: -7841.75064213 hartree
twoeener: 3400.70217274 hartree
kineticenergy: 1584.28672907 hartree
xcener: -135.015035036842 hartree
chargesum: -0.0000000
charge: -0.076487 -0.261004 -0.381894 -0.312549 -0.241160 0.125455 -0.087874 -0.073763 -0.260183 -0.246121 -0.048385 0.338533 -0.132988 -0.123597 0.248855 -0.140191 0.049320 -0.079053 -0.302931 0.020064 0.172106 -0.091123 0.121336 -0.231694 -0.265831 -0.097325 -0.108937 -0.142577 0.086777 0.082161 0.099936 0.088677 0.088614 0.069963 0.093847 0.091591 0.120982 0.086819 0.103709 0.113171 0.108872 0.116603 0.102759 0.148716 0.150216 0.107794 0.108418 0.126080 0.152227 0.127304 0.128311 0.126452
qa: -0.0765 -0.2610 -0.3819 -0.3125 -0.2412 0.1255 -0.0879 -0.0738 -0.2602 -0.2461 -0.0484 0.3385 -0.1330 -0.1236 0.2489 -0.1402 0.0493 -0.0791 -0.3029 0.0201 0.1721 -0.0911 0.1213 -0.2317 -0.2658 -0.0973 -0.1089 -0.1426 0.0868 0.0822 0.0999 0.0887 0.0886 0.0700 0.0938 0.0916 0.1210 0.0868 0.1037 0.1132 0.1089 0.1166 0.1028 0.1487 0.1502 0.1078 0.1084 0.1261 0.1522 0.1273 0.1283 0.1265
va: 2.4080 2.1214 2.1039 2.1814 2.3041 3.7882 3.8947 3.8041 3.9117 3.9045 3.8038 4.1921 3.6150 3.9457 4.2104 3.9806 3.8739 3.6289 3.9258 3.9599 3.6789 3.8846 3.4958 3.9974 3.9870 3.9280 3.9623 3.9841 1.0092 1.0328 1.0212 0.9985 1.0052 1.0064 1.0047 1.0048 1.0242 1.0099 1.0297 1.0045 1.0048 1.0079 0.9939 1.0087 1.0145 1.0152 1.0030 1.0064 0.9881 0.9987 1.0007 0.9995
dispcorr: -0.032083064 hartree
energy: -1590.108356663666
dipole: 11.74504 -11.79450 -0.04945 -1.75293 1.86384 0.11091 -14.37069 12.17860 -2.19209
magnitude: 2.19545 au
magnitude: 5.58040 debye
