program: Orca
programVersion: 5.0.2
elementType: S O O O O C C C C C C C C C C C C C C C C C C C C C C C H H H H H H H H H H H H H H H H H H H H H H H H
charge: 0
multiplicity: 1
keywords: wb97x-d3
keywords: def2-TZVPP
keywords: def2/J RIJCOSX
keywords: DEFGRID2
keywords: scfconv7
keywords: smallprint printgap noloewdin
keywords: NOSOSCF
formula: C23H24O4S
InChI: InChI=1/C23H24O4S/c1-23(2)19(12-17-8-9-28-22(17)25)20(23)21(24)27-14-16-11-18(26-13-16)10-15-6-4-3-5-7-15/h3-7,11-13,19-20H,8-10,14H2,1-2H3
52 atoms
S  -1.112948 -2.15065 -1.909315
O  2.235154 1.252564 0.955198
O  3.072014 2.458873 -0.729594
O  -0.467485 -2.365957 0.634525
O  -1.277262 2.154159 -1.53941
C  4.590806 -0.615723 0.751981
C  3.620816 -1.097749 -0.272505
C  4.049118 0.366699 -0.266461
C  4.210877 -0.565029 2.212721
C  6.041755 -0.991756 0.546873
C  2.240826 -1.524116 0.050678
C  3.084167 1.469382 -0.043392
C  1.232142 -1.47018 -0.818195
C  1.243468 -0.873732 -2.186965
C  -0.09441 -2.02379 -0.451318
C  0.207989 -1.614895 -3.035936
C  1.197418 2.221837 1.156871
C  0.053236 2.020232 0.227917
C  -1.119834 1.236659 0.46605
C  -0.105013 2.550145 -1.009362
C  -1.895928 1.360319 -0.63625
C  -3.22824 0.810703 -1.012287
C  -4.02364 0.402438 0.19867
C  -4.928187 1.287647 0.775194
C  -3.849769 -0.849635 0.778739
C  -5.649325 0.930967 1.904047
C  -4.565818 -1.20772 1.912098
C  -5.469239 -0.319756 2.476396
H  4.048692 -1.65472 -1.103718
H  4.744196 0.636447 -1.052974
H  3.152582 -0.405363 2.391142
H  4.49082 -1.506151 2.68958
H  4.755518 0.2325 2.720129
H  6.702809 -0.267839 1.025743
H  6.249347 -1.971302 0.980906
H  6.310219 -1.035463 -0.509526
H  2.050929 -1.95602 1.027745
H  2.226003 -0.912548 -2.658612
H  0.966647 0.182342 -2.110162
H  0.639206 -2.494341 -3.513399
H  -0.217259 -0.978773 -3.809442
H  0.877684 2.070474 2.186635
H  1.605061 3.229427 1.072007
H  -1.354883 0.667178 1.350623
H  0.510334 3.2034 -1.605955
H  -3.77808 1.564061 -1.582533
H  -3.09632 -0.046989 -1.679411
H  -5.06911 2.267959 0.335338
H  -3.144434 -1.55035 0.349363
H  -6.352885 1.630366 2.336561
H  -4.416927 -2.1851 2.351891
H  -6.031474 -0.60125 3.357082
totalener: -1590.07588416 hartree
nucrepener: 2854.30708148 hartree
electener: -4444.38296564 hartree
oneelecener: -7848.53140598 hartree
twoeener: 3404.14844034 hartree
kineticenergy: 1584.27685107 hartree
xcener: -135.013373934398 hartree
chargesum: 0.0000000
charge: -0.058579 -0.253706 -0.376628 -0.328711 -0.254116 0.126116 -0.090040 -0.105102 -0.271852 -0.245992 -0.042096 0.343033 -0.107469 -0.145755 0.228559 -0.126593 0.038779 -0.079268 -0.225581 -0.015167 0.157671 -0.106342 0.078733 -0.164147 -0.173991 -0.121381 -0.135154 -0.128736 0.093612 0.089887 0.092854 0.091146 0.094479 0.095523 0.089586 0.072364 0.121826 0.090403 0.115309 0.110040 0.105337 0.096350 0.122218 0.147605 0.157863 0.096773 0.104636 0.105234 0.116334 0.122024 0.128601 0.123509
qa: -0.0586 -0.2537 -0.3766 -0.3287 -0.2541 0.1261 -0.0900 -0.1051 -0.2719 -0.2460 -0.0421 0.3430 -0.1075 -0.1458 0.2286 -0.1266 0.0388 -0.0793 -0.2256 -0.0152 0.1577 -0.1063 0.0787 -0.1641 -0.1740 -0.1214 -0.1352 -0.1287 0.0936 0.0899 0.0929 0.0911 0.0945 0.0955 0.0896 0.0724 0.1218 0.0904 0.1153 0.1100 0.1053 0.0964 0.1222 0.1476 0.1579 0.0968 0.1046 0.1052 0.1163 0.1220 0.1286 0.1235
va: 2.4028 2.1052 2.1225 2.1555 2.2889 3.7391 3.8666 3.8249 3.9167 3.9111 3.7926 4.2203 3.6133 3.9682 4.2026 3.9695 3.8611 3.6452 3.9180 3.9221 3.6567 3.8645 3.5762 4.0202 3.9362 3.9546 4.0089 3.9482 1.0077 1.0299 1.0157 0.9998 1.0039 1.0039 1.0044 1.0078 1.0213 1.0083 1.0106 1.0046 1.0060 0.9991 1.0076 1.0099 1.0128 1.0188 1.0150 1.0111 1.0251 1.0006 0.9996 0.9996
dispcorr: -0.032350832 hartree
energy: -1590.108234993610
dipole: 15.00701 -13.93573 1.07128 -1.83340 1.70528 -0.12812 5.60649 -5.92773 -0.32123
magnitude: 1.12572 au
magnitude: 2.86135 debye
