program: Orca
programVersion: 5.0.2
elementType: S O O O O C C C C C C C C C C C C C C C C C C C C C C C H H H H H H H H H H H H H H H H H H H H H H H H
charge: 0
multiplicity: 1
keywords: wb97x-d3
keywords: def2-TZVPP
keywords: def2/J RIJCOSX
keywords: DEFGRID2
keywords: scfconv7
keywords: smallprint printgap noloewdin
keywords: NOSOSCF
formula: C23H24O4S
InChI: InChI=1/C23H24O4S/c1-23(2)19(12-17-8-9-28-22(17)25)20(23)21(24)27-14-16-11-18(26-13-16)10-15-6-4-3-5-7-15/h3-7,11-13,19-20H,8-10,14H2,1-2H3
52 atoms
S  -1.841029 -3.020278 0.619578
O  2.57478 2.564287 -0.573193
O  3.049467 1.322848 1.224971
O  -0.43512 -1.36268 2.097183
O  -1.710304 3.286471 0.176737
C  4.075603 -0.852472 -0.68164
C  2.59354 -0.918071 -0.9465
C  3.345474 0.423153 -0.979653
C  4.634842 -1.178349 0.68267
C  4.960522 -1.352514 -1.801644
C  1.601443 -1.178707 0.099047
C  3.000105 1.454514 0.030044
C  0.458402 -1.845564 -0.082226
C  -0.047637 -2.496744 -1.329968
C  -0.504364 -1.938007 1.044014
C  -1.0670 -3.56708 -0.927354
C  1.935772 3.555787 0.246362
C  0.495187 3.229744 0.424987
C  -0.086432 2.145462 1.159187
C  -0.54838 3.876835 -0.14657
C  -1.42277 2.224401 0.96441
C  -2.539545 1.34431 1.381066
C  -3.107096 0.47759 0.275997
C  -2.471344 0.315803 -0.948812
C  -4.293927 -0.213908 0.501704
C  -3.016301 -0.507083 -1.925577
C  -4.829697 -1.049798 -0.46302
C  -4.192297 -1.198557 -1.686526
H  2.315049 -1.269341 -1.934143
H  3.472829 0.824673 -1.978579
H  3.999587 -0.881555 1.509278
H  4.802427 -2.254241 0.752463
H  5.597578 -0.684289 0.820674
H  5.090222 -2.433874 -1.736282
H  4.548112 -1.126381 -2.786132
H  5.949241 -0.894271 -1.744609
H  1.786566 -0.781427 1.089779
H  0.750927 -2.946929 -1.921156
H  -0.539263 -1.751815 -1.959593
H  -0.585134 -4.530832 -0.764055
H  -1.840923 -3.692954 -1.681934
H  2.451591 3.64889 1.202431
H  2.052259 4.492818 -0.297163
H  0.418162 1.39747 1.747625
H  -0.605058 4.74783 -0.780112
H  -2.168187 0.697551 2.178933
H  -3.34679 1.939621 1.818481
H  -1.541362 0.832203 -1.151114
H  -4.803345 -0.101481 1.4519
H  -2.51908 -0.599482 -2.883581
H  -5.749094 -1.583672 -0.260981
H  -4.615556 -1.839673 -2.448861
totalener: -1590.07872006 hartree
nucrepener: 2884.61107777 hartree
electener: -4474.68979782 hartree
oneelecener: -7909.49405950 hartree
twoeener: 3434.80426168 hartree
kineticenergy: 1584.27377995 hartree
xcener: -135.017635211818 hartree
chargesum: -0.0000000
charge: -0.027788 -0.259885 -0.388776 -0.352442 -0.252135 0.091822 0.055793 -0.085109 -0.241376 -0.241244 -0.160348 0.345064 -0.138606 -0.183276 0.263034 -0.136592 0.055418 -0.050403 -0.277846 -0.041869 0.205631 -0.082480 0.083697 -0.169127 -0.170371 -0.157597 -0.099403 -0.158759 0.083652 0.086421 0.107706 0.083627 0.088000 0.090823 0.072147 0.093003 0.141538 0.093412 0.101609 0.113462 0.096470 0.118087 0.094363 0.163238 0.131780 0.114969 0.102226 0.117221 0.104769 0.131157 0.121051 0.124241
qa: -0.0278 -0.2599 -0.3888 -0.3524 -0.2521 0.0918 0.0558 -0.0851 -0.2414 -0.2412 -0.1603 0.3451 -0.1386 -0.1833 0.2630 -0.1366 0.0554 -0.0504 -0.2778 -0.0419 0.2056 -0.0825 0.0837 -0.1691 -0.1704 -0.1576 -0.0994 -0.1588 0.0837 0.0864 0.1077 0.0836 0.0880 0.0908 0.0721 0.0930 0.1415 0.0934 0.1016 0.1135 0.0965 0.1181 0.0944 0.1632 0.1318 0.1150 0.1022 0.1172 0.1048 0.1312 0.1211 0.1242
va: 2.4339 2.1338 2.0949 2.1345 2.3104 3.7598 3.7600 3.8834 3.9090 3.9048 3.8435 4.1953 3.6251 3.9836 4.2188 3.9815 3.8954 3.7490 3.9915 3.9953 3.6124 3.8775 3.6545 3.8660 4.0208 3.8805 3.9266 3.9533 1.0093 1.0287 1.0198 1.0018 1.0028 1.0046 1.0071 1.0050 1.0209 1.0048 1.0075 1.0040 1.0085 1.0081 0.9961 1.0248 1.0092 1.0098 1.0073 1.0094 1.0102 0.9950 0.9996 0.9992
dispcorr: -0.033185624 hartree
energy: -1590.111905681330
dipole: 14.13988 -13.53819 0.60169 -7.86358 7.48737 -0.37621 -10.63181 8.79683 -1.83498
magnitude: 1.96741 au
magnitude: 5.00076 debye
