program: Orca
programVersion: 5.0.2
elementType: S O O O O C C C C C C C C C C C C C C C C C C C C C C C H H H H H H H H H H H H H H H H H H H H H H H H
charge: 0
multiplicity: 1
keywords: wb97x-d3
keywords: def2-TZVPP
keywords: def2/J RIJCOSX
keywords: DEFGRID2
keywords: scfconv7
keywords: smallprint printgap noloewdin
keywords: NOSOSCF
formula: C23H24O4S
InChI: InChI=1/C23H24O4S/c1-23(2)19(12-17-8-9-28-22(17)25)20(23)21(24)27-14-16-11-18(26-13-16)10-15-6-4-3-5-7-15/h3-7,11-13,19-20H,8-10,14H2,1-2H3
52 atoms
S  -0.175403 -0.074371 -3.961301
O  2.256158 1.803036 0.364821
O  1.598682 0.84975 2.281863
O  -1.008779 -1.317326 -1.794052
O  -1.765213 1.893036 -1.40577
C  3.267489 -1.592089 1.355335
C  2.989483 -1.223003 -0.078112
C  3.331004 -0.154816 0.95133
C  2.154626 -2.117923 2.231445
C  4.594857 -2.261563 1.627408
C  1.637742 -1.273366 -0.66553
C  2.293697 0.857676 1.304315
C  1.317888 -0.709525 -1.831503
C  2.200937 0.115458 -2.709762
C  -0.069168 -0.816315 -2.346187
C  1.626074 0.086826 -4.126897
C  1.235103 2.808333 0.464848
C  -0.072966 2.313911 -0.037516
C  -1.045753 1.523663 0.654985
C  -0.573433 2.498697 -1.282784
C  -2.047211 1.296296 -0.226415
C  -3.322376 0.534479 -0.137494
C  -3.443711 -0.160065 1.190787
C  -4.210999 0.383016 2.213326
C  -2.750307 -1.343833 1.427737
C  -4.291168 -0.242039 3.449938
C  -2.826559 -1.969072 2.662101
C  -3.596452 -1.419242 3.678027
H  3.788843 -1.417257 -0.788599
H  4.319231 0.282072 0.836863
H  2.376202 -1.923612 3.280522
H  1.181643 -1.676863 2.031373
H  2.068789 -3.198335 2.101243
H  4.526204 -3.337759 1.461306
H  5.387634 -1.878392 0.982744
H  4.904824 -2.102361 2.661414
H  0.854752 -1.796794 -0.127157
H  3.234971 -0.232748 -2.710645
H  2.212726 1.139951 -2.330246
H  2.00683 -0.762672 -4.693494
H  1.856184 0.994301 -4.681661
H  1.156328 3.165298 1.492732
H  1.598598 3.629632 -0.152189
H  -0.993572 1.170364 1.670626
H  -0.205704 3.027211 -2.14793
H  -4.171689 1.20818 -0.288305
H  -3.35948 -0.196444 -0.949836
H  -4.75139 1.306586 2.042353
H  -2.144709 -1.769158 0.636488
H  -4.895845 0.193154 4.234941
H  -2.283156 -2.889524 2.832492
H  -3.655472 -1.908337 4.641464
totalener: -1590.07494648 hartree
nucrepener: 2891.94248854 hartree
electener: -4482.01743502 hartree
oneelecener: -7924.34617930 hartree
twoeener: 3442.32874428 hartree
kineticenergy: 1584.28036391 hartree
xcener: -135.011601885594 hartree
chargesum: -0.0000000
charge: -0.032710 -0.259901 -0.354125 -0.349296 -0.243948 0.104841 -0.086388 -0.058168 -0.242846 -0.246369 -0.013303 0.314551 -0.159398 -0.132303 0.268467 -0.141392 0.025798 -0.041096 -0.222535 -0.083884 0.168933 -0.051445 0.011635 -0.149430 -0.165471 -0.126937 -0.121769 -0.124503 0.085119 0.084721 0.095921 0.072210 0.090902 0.090399 0.068905 0.095296 0.128099 0.082700 0.093375 0.104266 0.100592 0.123996 0.105355 0.156603 0.133971 0.089863 0.108995 0.103919 0.135499 0.121241 0.119577 0.121471
qa: -0.0327 -0.2599 -0.3541 -0.3493 -0.2439 0.1048 -0.0864 -0.0582 -0.2428 -0.2464 -0.0133 0.3146 -0.1594 -0.1323 0.2685 -0.1414 0.0258 -0.0411 -0.2225 -0.0839 0.1689 -0.0514 0.0116 -0.1494 -0.1655 -0.1269 -0.1218 -0.1245 0.0851 0.0847 0.0959 0.0722 0.0909 0.0904 0.0689 0.0953 0.1281 0.0827 0.0934 0.1043 0.1006 0.1240 0.1054 0.1566 0.1340 0.0899 0.1090 0.1039 0.1355 0.1212 0.1196 0.1215
va: 2.4256 2.1085 2.1372 2.1412 2.2890 3.8559 3.8609 3.8156 3.9366 3.8982 3.7604 4.2474 3.6205 3.9513 4.1562 3.9933 3.8682 3.6130 3.9481 3.9651 3.6670 3.8353 3.6947 3.9922 3.9401 3.9650 3.9590 3.9569 1.0069 1.0243 1.0084 1.0151 0.9987 1.0049 1.0066 1.0046 1.0105 1.0115 1.0185 1.0022 1.0057 1.0051 0.9984 1.0132 1.0136 1.0115 1.0181 1.0118 1.0209 1.0009 1.0032 1.0001
dispcorr: -0.032833540 hartree
energy: -1590.107780018280
dipole: 13.67521 -11.80892 1.86629 -8.69964 9.02746 0.32781 11.76142 -12.23519 -0.47376
magnitude: 1.95319 au
magnitude: 4.96461 debye
