program: Orca
programVersion: 5.0.2
elementType: S O O O O C C C C C C C C C C C C C C C C C C C C C C C H H H H H H H H H H H H H H H H H H H H H H H H
charge: 0
multiplicity: 1
keywords: wb97x-d3
keywords: def2-TZVPP
keywords: def2/J RIJCOSX
keywords: DEFGRID2
keywords: scfconv7
keywords: smallprint printgap noloewdin
keywords: NOSOSCF
formula: C23H24O4S
InChI: InChI=1/C23H24O4S/c1-23(2)19(12-17-8-9-28-22(17)25)20(23)21(24)27-14-16-11-18(26-13-16)10-15-6-4-3-5-7-15/h3-7,11-13,19-20H,8-10,14H2,1-2H3
52 atoms
S  -0.981097 -2.718746 1.683542
O  1.861417 2.18694 -1.279227
O  3.07683 1.823288 0.561149
O  0.991907 -1.447287 2.888288
O  -0.972719 1.189656 1.893956
C  4.517983 -0.429198 -0.960773
C  3.123133 -0.97418 -0.874999
C  3.378921 0.451543 -1.384884
C  5.330791 -0.167963 0.284333
C  5.361503 -0.961536 -2.09802
C  2.417556 -1.178394 0.399523
C  2.801362 1.553549 -0.577289
C  1.174957 -1.655609 0.497576
C  0.238339 -2.020262 -0.608322
C  0.560776 -1.82577 1.838868
C  -0.711805 -3.091948 -0.073247
C  1.002591 3.071217 -0.543743
C  -0.000553 2.309139 0.24904
C  -1.276613 1.833807 -0.197431
C  0.121028 1.876649 1.52773
C  -1.823617 1.165516 0.846467
C  -3.119653 0.462452 1.051823
C  -3.948774 0.449296 -0.201678
C  -4.999846 1.341044 -0.376484
C  -3.661383 -0.448613 -1.225132
C  -5.751001 1.334253 -1.543615
C  -4.404807 -0.457664 -2.39436
C  -5.455178 0.435132 -2.556241
H  2.829196 -1.658056 -1.665301
H  3.234627 0.573028 -2.452671
H  4.756959 0.218256 1.119247
H  5.81946 -1.091564 0.598823
H  6.112536 0.562103 0.070701
H  4.769036 -1.163551 -2.991697
H  6.138158 -0.245644 -2.37121
H  5.851975 -1.892235 -1.808818
H  2.928988 -0.926937 1.321361
H  0.752493 -2.378645 -1.501156
H  -0.329686 -1.130546 -0.899222
H  -0.277014 -4.087303 -0.162722
H  -1.669244 -3.093323 -0.590977
H  1.591572 3.734299 0.090546
H  0.513819 3.676908 -1.30535
H  -1.728743 1.986187 -1.164368
H  0.908463 1.965578 2.25729
H  -2.923511 -0.561495 1.386876
H  -3.675134 0.944278 1.862356
H  -5.235484 2.048374 0.409631
H  -2.842951 -1.148214 -1.100559
H  -6.569856 2.032097 -1.659921
H  -4.167318 -1.164679 -3.178601
H  -6.041119 0.427201 -3.465738
totalener: -1590.07668035 hartree
nucrepener: 2839.05631749 hartree
electener: -4429.13299784 hartree
oneelecener: -7817.87088273 hartree
twoeener: 3388.73788489 hartree
kineticenergy: 1584.28035457 hartree
xcener: -135.012400689830 hartree
chargesum: 0.0000000
charge: -0.045247 -0.260032 -0.387084 -0.312209 -0.240894 0.126837 -0.064195 -0.073284 -0.256718 -0.241923 -0.014114 0.334471 -0.180834 -0.143669 0.236040 -0.158062 0.054813 -0.045725 -0.279919 -0.005944 0.146647 -0.080220 0.031593 -0.122739 -0.121999 -0.134240 -0.144668 -0.116212 0.083975 0.083049 0.103908 0.089896 0.086300 0.070373 0.094029 0.092382 0.131562 0.085689 0.095678 0.115865 0.104182 0.116296 0.102228 0.135614 0.156458 0.111418 0.091799 0.110129 0.067380 0.125131 0.120429 0.125758
qa: -0.0452 -0.2600 -0.3871 -0.3122 -0.2409 0.1268 -0.0642 -0.0733 -0.2567 -0.2419 -0.0141 0.3345 -0.1808 -0.1437 0.2360 -0.1581 0.0548 -0.0457 -0.2799 -0.0059 0.1466 -0.0802 0.0316 -0.1227 -0.1220 -0.1342 -0.1447 -0.1162 0.0840 0.0830 0.1039 0.0899 0.0863 0.0704 0.0940 0.0924 0.1316 0.0857 0.0957 0.1159 0.1042 0.1163 0.1022 0.1356 0.1565 0.1114 0.0918 0.1101 0.0674 0.1251 0.1204 0.1258
va: 2.4106 2.1302 2.0959 2.1747 2.3025 3.7910 3.8256 3.8503 3.9015 3.8981 3.7832 4.2344 3.6286 3.9504 4.2005 3.9795 3.8636 3.6181 3.9549 3.9512 3.6709 3.8081 3.6097 3.9764 3.9417 3.9741 3.9998 3.9443 1.0106 1.0314 1.0249 0.9998 1.0033 1.0067 1.0052 1.0046 1.0274 1.0156 1.0109 1.0005 1.0006 1.0089 0.9933 1.0110 1.0153 1.0288 1.0179 1.0111 1.0155 1.0005 1.0019 0.9996
dispcorr: -0.031396769 hartree
energy: -1590.108077121314
dipole: 10.34683 -10.44302 -0.09619 -2.51287 2.28709 -0.22578 -15.81444 13.63926 -2.17518
magnitude: 2.18898 au
magnitude: 5.56395 debye
