program: Orca
programVersion: 5.0.2
elementType: S O O O O C C C C C C C C C C C C C C C C C C C C C C C H H H H H H H H H H H H H H H H H H H H H H H H
charge: 0
multiplicity: 1
keywords: wb97x-d3
keywords: def2-TZVPP
keywords: def2/J RIJCOSX
keywords: DEFGRID2
keywords: scfconv7
keywords: smallprint printgap noloewdin
keywords: NOSOSCF
formula: C23H24O4S
InChI: InChI=1/C23H24O4S/c1-23(2)19(12-17-8-9-28-22(17)25)20(23)21(24)27-14-16-11-18(26-13-16)10-15-6-4-3-5-7-15/h3-7,11-13,19-20H,8-10,14H2,1-2H3
52 atoms
S  -1.395483 -2.270451 1.111575
O  2.31318 2.164253 -0.804318
O  2.723723 0.969354 1.040205
O  0.812568 -3.020992 2.351441
O  -1.544093 1.854612 1.337507
C  4.578539 -0.759747 -0.730324
C  3.215071 -1.34045 -0.882885
C  3.433844 0.160291 -1.097979
C  5.243456 -0.692439 0.622677
C  5.555795 -1.030387 -1.85153
C  2.412664 -1.829638 0.256261
C  2.80958 1.110351 -0.151356
C  1.097661 -2.027827 0.181017
C  0.205179 -1.75344 -0.984818
C  0.349229 -2.524298 1.364475
C  -1.150411 -1.329795 -0.423088
C  1.609152 3.133974 -0.019918
C  0.21558 2.715059 0.298874
C  -0.962107 2.977309 -0.471953
C  -0.210333 2.022536 1.383377
C  -2.000223 2.435886 0.207502
C  -3.461791 2.362524 -0.059506
C  -3.934879 0.969706 -0.403468
C  -4.088782 0.584154 -1.730539
C  -4.204163 0.042563 0.598135
C  -4.514278 -0.696229 -2.053164
C  -4.626619 -1.239447 0.279831
C  -4.786453 -1.612095 -1.047194
H  3.027044 -1.870537 -1.812617
H  3.409413 0.488807 -2.130532
H  5.768277 -1.629707 0.815872
H  5.985339 0.107353 0.636432
H  4.556765 -0.512469 1.443512
H  6.065931 -1.981579 -1.691822
H  5.063135 -1.080072 -2.823593
H  6.315472 -0.249022 -1.904373
H  2.910895 -2.047239 1.193864
H  0.08754 -2.66172 -1.584439
H  0.602208 -0.976954 -1.640535
H  -1.972609 -1.536333 -1.10379
H  -1.159389 -0.267786 -0.19095
H  2.166424 3.359968 0.889999
H  1.599326 4.030728 -0.638298
H  -1.020842 3.510476 -1.407698
H  0.308253 1.597891 2.226723
H  -4.014535 2.737016 0.806994
H  -3.684201 3.043287 -0.882706
H  -3.878246 1.294082 -2.521886
H  -4.079014 0.320808 1.637125
H  -4.636027 -0.977253 -3.091269
H  -4.826012 -1.949842 1.070957
H  -5.118816 -2.611477 -1.295053
totalener: -1590.07903910 hartree
nucrepener: 2851.75162097 hartree
electener: -4441.83066007 hartree
oneelecener: -7843.44102303 hartree
twoeener: 3401.61036296 hartree
kineticenergy: 1584.28728749 hartree
xcener: -135.015511693755 hartree
chargesum: 0.0000000
charge: -0.050557 -0.266308 -0.396385 -0.321144 -0.248723 0.120083 -0.072462 -0.087186 -0.275390 -0.237420 -0.058059 0.353381 -0.118836 -0.154045 0.222330 -0.078623 0.060357 -0.074241 -0.250457 -0.006211 0.190405 -0.132009 0.039992 -0.136815 -0.105896 -0.142757 -0.180472 -0.111214 0.098723 0.085045 0.093399 0.087332 0.107180 0.091526 0.071058 0.092649 0.115273 0.101536 0.084999 0.108529 0.061489 0.116998 0.099929 0.126275 0.156420 0.112512 0.094547 0.104449 0.117162 0.124815 0.139085 0.127735
qa: -0.0506 -0.2663 -0.3964 -0.3211 -0.2487 0.1201 -0.0725 -0.0872 -0.2754 -0.2374 -0.0581 0.3534 -0.1188 -0.1540 0.2223 -0.0786 0.0604 -0.0742 -0.2505 -0.0062 0.1904 -0.1320 0.0400 -0.1368 -0.1059 -0.1428 -0.1805 -0.1112 0.0987 0.0850 0.0934 0.0873 0.1072 0.0915 0.0711 0.0926 0.1153 0.1015 0.0850 0.1085 0.0615 0.1170 0.0999 0.1263 0.1564 0.1125 0.0945 0.1044 0.1172 0.1248 0.1391 0.1277
va: 2.4340 2.1319 2.0817 2.1733 2.3045 3.7790 3.8481 3.8507 3.9096 3.8996 3.8617 4.1455 3.6383 4.0388 4.2784 3.9531 3.8746 3.6528 4.0300 3.9337 3.6279 3.8789 3.6103 3.9443 3.8765 3.9438 3.8971 3.8917 1.0053 1.0305 0.9987 1.0032 1.0207 1.0050 1.0066 1.0048 1.0267 1.0047 1.0040 1.0155 1.0127 1.0079 0.9950 1.0156 1.0137 1.0049 1.0123 1.0118 1.0207 1.0015 1.0012 1.0005
dispcorr: -0.031942531 hartree
energy: -1590.110981635469
dipole: 12.79730 -12.72938 0.06791 1.41975 -0.21946 1.20029 -13.31491 11.21485 -2.10005
magnitude: 2.41982 au
magnitude: 6.15069 debye
