program: Orca
programVersion: 5.0.2
elementType: S O O O O C C C C C C C C C C C C C C C C C C C C C C C H H H H H H H H H H H H H H H H H H H H H H H H
charge: 0
multiplicity: 1
keywords: wb97x-d3
keywords: def2-TZVPP
keywords: def2/J RIJCOSX
keywords: DEFGRID2
keywords: scfconv7
keywords: smallprint printgap noloewdin
keywords: NOSOSCF
formula: C23H24O4S
InChI: InChI=1/C23H24O4S/c1-23(2)19(12-17-8-9-28-22(17)25)20(23)21(24)27-14-16-11-18(26-13-16)10-15-6-4-3-5-7-15/h3-7,11-13,19-20H,8-10,14H2,1-2H3
52 atoms
S  -0.030683 -3.332668 -3.522446
O  2.203708 1.340694 -0.9221
O  2.86583 2.436692 0.915106
O  -1.249496 -1.478719 -2.114471
O  -1.324025 3.406898 0.462033
C  1.945861 -0.460742 1.957916
C  2.108689 -1.180729 0.631256
C  2.90313 0.073515 0.940017
C  0.68308 0.312296 2.254831
C  2.534355 -1.134253 3.172626
C  1.02883 -1.232259 -0.357019
C  2.656816 1.411624 0.326994
C  0.916298 -2.164214 -1.309202
C  1.856066 -3.291126 -1.609499
C  -0.25775 -2.151884 -2.2097
C  1.708458 -3.630815 -3.093176
C  1.647214 2.541178 -1.481163
C  0.296198 2.757303 -0.903062
C  -0.869065 1.965305 -1.153439
C  -0.048087 3.611206 0.089322
C  -1.815734 2.396366 -0.288545
C  -3.169831 1.881976 0.044926
C  -3.107791 0.913524 1.204299
C  -2.849918 -0.43419 0.973669
C  -3.254749 1.355519 2.513876
C  -2.760446 -1.325545 2.031647
C  -3.157273 0.466269 3.574652
C  -2.914591 -0.878216 3.336417
H  2.707355 -2.084155 0.68233
H  3.956225 -0.085978 1.152626
H  0.233322 0.788016 1.38437
H  -0.077432 -0.337756 2.688195
H  0.897244 1.106298 2.971206
H  1.82091 -1.834095 3.610536
H  3.442779 -1.689653 2.934354
H  2.788817 -0.395902 3.934775
H  0.243621 -0.487952 -0.297021
H  1.59384 -4.167512 -1.009312
H  2.893536 -3.041357 -1.385696
H  1.95996 -4.667716 -3.305965
H  2.340057 -2.991447 -3.709298
H  2.305586 3.393553 -1.309365
H  1.599791 2.35089 -2.552354
H  -0.976812 1.158488 -1.861225
H  0.501191 4.374352 0.615736
H  -3.84631 2.708969 0.273927
H  -3.571198 1.379068 -0.83599
H  -2.709257 -0.789228 -0.040174
H  -3.447217 2.403899 2.707921
H  -2.568478 -2.372112 1.83386
H  -3.275168 0.824691 4.58899
H  -2.847609 -1.573799 4.162831
totalener: -1590.07658444 hartree
nucrepener: 2869.33196625 hartree
electener: -4459.40855069 hartree
oneelecener: -7878.69598826 hartree
twoeener: 3419.28743757 hartree
kineticenergy: 1584.28519038 hartree
xcener: -135.014287870152 hartree
chargesum: -0.0000000
charge: -0.032169 -0.247737 -0.349854 -0.367990 -0.248077 0.080042 0.030112 0.005367 -0.214366 -0.242887 -0.054735 0.257456 -0.108782 -0.184982 0.247917 -0.132794 0.042536 -0.039693 -0.359132 0.004371 0.236352 -0.119114 0.069647 -0.189084 -0.144206 -0.137921 -0.113241 -0.151603 0.085371 0.082124 0.015783 0.099009 0.107688 0.090156 0.069086 0.095558 0.068250 0.098857 0.080829 0.102426 0.102435 0.113029 0.106749 0.164392 0.144711 0.101936 0.109532 0.147633 0.109010 0.123504 0.123135 0.123364
qa: -0.0322 -0.2477 -0.3499 -0.3680 -0.2481 0.0800 0.0301 0.0054 -0.2144 -0.2429 -0.0547 0.2575 -0.1088 -0.1850 0.2479 -0.1328 0.0425 -0.0397 -0.3591 0.0044 0.2364 -0.1191 0.0696 -0.1891 -0.1442 -0.1379 -0.1132 -0.1516 0.0854 0.0821 0.0158 0.0990 0.1077 0.0902 0.0691 0.0956 0.0682 0.0989 0.0808 0.1024 0.1024 0.1130 0.1067 0.1644 0.1447 0.1019 0.1095 0.1476 0.1090 0.1235 0.1231 0.1234
va: 2.4309 2.1302 2.1433 2.1088 2.3056 3.8672 3.7010 3.7752 3.9490 3.8861 3.9131 4.3420 3.6014 3.9916 4.1820 3.9784 3.8938 3.6589 3.9653 3.9718 3.6010 3.8682 3.6187 3.9153 4.0029 3.9166 3.9321 3.9279 1.0045 1.0173 1.0038 1.0027 1.0115 1.0035 1.0080 1.0044 0.9991 0.9983 1.0047 1.0072 1.0013 1.0088 0.9947 1.0205 1.0116 1.0132 1.0111 1.0153 1.0144 1.0028 1.0003 1.0007
dispcorr: -0.033128958 hartree
energy: -1590.109713397695
dipole: 5.75454 -4.62249 1.13205 -5.47701 4.60148 -0.87553 15.91829 -15.64876 0.26953
magnitude: 1.45627 au
magnitude: 3.70155 debye
