program: Orca
programVersion: 5.0.2
elementType: S O O O O C C C C C C C C C C C C C C C C C C C C C C C H H H H H H H H H H H H H H H H H H H H H H H H
charge: 0
multiplicity: 1
keywords: wb97x-d3
keywords: def2-TZVPP
keywords: def2/J RIJCOSX
keywords: DEFGRID2
keywords: scfconv7
keywords: smallprint printgap noloewdin
keywords: NOSOSCF
formula: C23H24O4S
InChI: InChI=1/C23H24O4S/c1-23(2)19(12-17-8-9-28-22(17)25)20(23)21(24)27-14-16-11-18(26-13-16)10-15-6-4-3-5-7-15/h3-7,11-13,19-20H,8-10,14H2,1-2H3
52 atoms
S  -1.32425 -3.827247 0.389492
O  2.498382 2.501582 -0.676428
O  2.629322 1.284944 1.193587
O  -0.006607 -2.367884 2.147154
O  -1.813708 3.371737 -0.24909
C  4.269834 -0.74075 -0.463144
C  2.848188 -1.071166 -0.837012
C  3.360284 0.372393 -0.901864
C  4.750626 -0.879532 0.961057
C  5.321626 -1.141511 -1.472633
C  1.847615 -1.488726 0.145923
C  2.802576 1.40146 0.008053
C  0.886804 -2.388489 -0.087466
C  0.616232 -3.16013 -1.341576
C  -0.053758 -2.732008 1.007209
C  -0.866147 -3.533948 -1.343189
C  1.824844 3.555401 0.028146
C  0.366461 3.293452 0.154447
C  -0.311767 2.430342 1.075609
C  -0.606842 3.829079 -0.619526
C  -1.629229 2.517568 0.782099
C  -2.834875 1.862848 1.355477
C  -3.52754 0.944667 0.376908
C  -4.421477 1.453559 -0.559906
C  -3.27458 -0.422213 0.387469
C  -5.049196 0.614917 -1.467786
C  -3.909206 -1.265053 -0.513281
C  -4.796352 -0.749022 -1.445825
H  2.7308 -1.516929 -1.818644
H  3.516097 0.734411 -1.911367
H  4.010924 -0.618135 1.709622
H  5.062622 -1.909864 1.138292
H  5.618594 -0.239117 1.124224
H  4.97032 -1.034406 -2.499736
H  6.215415 -0.525417 -1.363136
H  5.614795 -2.182494 -1.328648
H  1.877022 -1.041581 1.132034
H  1.220628 -4.071743 -1.353393
H  0.859492 -2.597491 -2.243704
H  -1.063881 -4.431089 -1.926307
H  -1.477977 -2.721764 -1.736779
H  2.28538 3.711669 1.00465
H  2.00088 4.444848 -0.575775
H  0.132722 1.824168 1.846869
H  -0.582444 4.530856 -1.438005
H  -2.517955 1.300494 2.234792
H  -3.537406 2.622989 1.711053
H  -4.632187 2.515848 -0.578057
H  -2.584971 -0.838657 1.112579
H  -5.742862 1.026969 -2.18918
H  -3.714108 -2.32877 -0.469134
H  -5.295119 -1.406423 -2.146107
totalener: -1590.08071313 hartree
nucrepener: 2769.12330347 hartree
electener: -4359.20401660 hartree
oneelecener: -7678.24855060 hartree
twoeener: 3319.04453401 hartree
kineticenergy: 1584.27249739 hartree
xcener: -135.009926054372 hartree
chargesum: -0.0000000
charge: -0.055033 -0.260984 -0.406247 -0.323802 -0.255842 0.077792 0.050031 -0.092180 -0.246741 -0.237614 -0.103721 0.381801 -0.158890 -0.164340 0.243611 -0.143133 0.053990 -0.072465 -0.265761 -0.033963 0.220905 -0.125380 0.091178 -0.155020 -0.169728 -0.122912 -0.143002 -0.149562 0.078921 0.086782 0.110252 0.087255 0.087258 0.071807 0.092166 0.092129 0.137971 0.101828 0.079817 0.104624 0.107077 0.116037 0.097321 0.156824 0.132722 0.098971 0.105923 0.107302 0.129351 0.121484 0.140696 0.122492
qa: -0.0550 -0.2610 -0.4062 -0.3238 -0.2558 0.0778 0.0500 -0.0922 -0.2467 -0.2376 -0.1037 0.3818 -0.1589 -0.1643 0.2436 -0.1431 0.0540 -0.0725 -0.2658 -0.0340 0.2209 -0.1254 0.0912 -0.1550 -0.1697 -0.1229 -0.1430 -0.1496 0.0789 0.0868 0.1103 0.0873 0.0873 0.0718 0.0922 0.0921 0.1380 0.1018 0.0798 0.1046 0.1071 0.1160 0.0973 0.1568 0.1327 0.0990 0.1059 0.1073 0.1294 0.1215 0.1407 0.1225
va: 2.3933 2.1417 2.0769 2.1640 2.3142 3.7657 3.7549 3.8911 3.9106 3.9057 3.8438 4.1424 3.6575 3.9992 4.2223 3.9727 3.8933 3.7199 4.0116 4.0035 3.6288 3.8838 3.6559 4.0029 3.9791 3.9639 3.8946 4.0034 1.0130 1.0291 1.0198 1.0014 1.0019 1.0077 1.0051 1.0041 1.0308 1.0004 1.0085 1.0093 0.9992 1.0056 0.9972 1.0190 1.0069 1.0134 1.0013 1.0183 1.0059 1.0001 1.0063 1.0019
dispcorr: -0.027619021 hartree
energy: -1590.108332150619
dipole: 14.30563 -13.37573 0.92990 -3.23093 3.46550 0.23458 -8.92974 6.98122 -1.94853
magnitude: 2.17175 au
magnitude: 5.52015 debye
