program: Orca
programVersion: 5.0.2
elementType: O O O O N N C C C C C C C C C C C C C C C C C H H H H H H H H H H H H H H H H H H H H H H
charge: 0
multiplicity: 1
keywords: wb97x-d3
keywords: def2-TZVPP
keywords: def2/J RIJCOSX
keywords: DEFGRID2
keywords: scfconv7
keywords: smallprint printgap noloewdin
keywords: NOSOSCF
formula: C17H22N2O4
InChI: InChI=1/C17H22N2O4/c1-6-7-18-9-13(20)19(16(18)22)10-23-15(21)14-12(8-11(2)3)17(14,4)5/h1,8,12,14H,7,9-10H2,2-5H3
45 atoms
O  0.995323 1.10842 -0.425691
O  2.224688 2.235959 -1.898109
O  -1.069481 2.210376 1.969841
O  -1.80578 -0.199437 -1.825533
N  -1.257442 1.262569 -0.115563
N  -2.832752 -0.240606 0.239309
C  3.701095 0.295703 0.797008
C  3.148291 -0.845932 0.017507
C  3.266906 0.525753 -0.64527
C  5.195653 0.334613 1.014314
C  2.9326 0.891544 1.950932
C  1.862138 -1.506696 0.359188
C  2.135713 1.370748 -1.051712
C  1.113305 -2.209393 -0.493465
C  -0.124614 -2.923626 -0.044142
C  1.425362 -2.329601 -1.952548
C  -0.149741 1.88438 -0.759159
C  -1.580009 1.426364 1.207204
C  -1.967568 0.198748 -0.691081
C  -2.682968 0.446566 1.49695
C  -3.669631 -1.404571 0.085179
C  -5.079974 -1.096539 0.300811
C  -6.237736 -0.848842 0.500875
H  3.898839 -1.526971 -0.376134
H  4.088329 0.625166 -1.345299
H  5.546289 1.35985 1.145887
H  5.46479 -0.22593 1.911709
H  5.74003 -0.100172 0.175435
H  3.191339 1.944163 2.077501
H  1.851952 0.825124 1.858197
H  3.209483 0.375957 2.872555
H  1.541138 -1.444534 1.39519
H  -0.980138 -2.665149 -0.672034
H  -0.000966 -4.006512 -0.131146
H  -0.378893 -2.696744 0.991422
H  2.384557 -1.89336 -2.225775
H  1.427299 -3.375218 -2.269382
H  0.651866 -1.830611 -2.543022
H  -0.044675 2.906686 -0.398175
H  -0.321107 1.90028 -1.833776
H  -2.389344 -0.231036 2.302915
H  -3.592844 0.970038 1.800615
H  -3.356431 -2.181817 0.787312
H  -3.528172 -1.808633 -0.917072
H  -7.267021 -0.623951 0.671132
elementType: O N C H
totalener: -1071.53570461 hartree
nucrepener: 2046.23019494 hartree
electener: -3117.76589955 hartree
oneelecener: -5524.34059600 hartree
twoeener: 2406.57469645 hartree
cpcmener: -0.05004827 hartree
kineticenergy: 1066.86626608 hartree
xcener: -102.627652430729 hartree
chargesum: -0.0000000
charge: -0.251602 -0.501287 -0.473682 -0.514103 -0.109260 -0.122746 0.139110 -0.022300 -0.151637 -0.268570 -0.284874 -0.252240 0.445534 -0.030982 -0.239838 -0.259893 0.058481 0.308764 0.359812 0.011560 -0.085093 -0.453581 0.114703 0.115110 0.095893 0.097037 0.093918 0.088580 0.104650 0.077756 0.101764 0.125979 0.080114 0.115147 0.093229 0.092993 0.105479 0.093448 0.145008 0.133423 0.130393 0.128128 0.145885 0.132452 0.287336
qa: -0.2516 -0.5013 -0.4737 -0.5141 -0.1093 -0.1227 0.1391 -0.0223 -0.1516 -0.2686 -0.2849 -0.2522 0.4455 -0.0310 -0.2398 -0.2599 0.0585 0.3088 0.3598 0.0116 -0.0851 -0.4536 0.1147 0.1151 0.0959 0.0970 0.0939 0.0886 0.1047 0.0778 0.1018 0.1260 0.0801 0.1151 0.0932 0.0930 0.1055 0.0934 0.1450 0.1334 0.1304 0.1281 0.1459 0.1325 0.2873
va: 2.1066 1.9977 2.0325 1.9887 3.1648 3.1999 3.7344 3.7941 3.8931 3.9070 3.9137 3.8286 4.0695 3.6925 3.9187 3.9420 3.9045 4.1766 4.2973 3.8995 3.9287 3.8774 3.4905 1.0044 1.0277 1.0014 1.0019 1.0050 1.0008 1.0093 0.9994 0.9981 1.0020 0.9964 1.0055 1.0054 0.9995 1.0064 0.9987 1.0098 1.0057 1.0047 0.9813 1.0053 0.9452
dispcorr: -0.025872920 hartree
energy: -1071.561577529527
dipole: 15.73423 -16.93937 -1.20514 -13.85302 11.94680 -1.90621 5.09466 -3.33520 1.75946
magnitude: 2.86037 au
magnitude: 7.27048 debye
