program: Orca
programVersion: 5.0.2
elementType: O O O O N N C C C C C C C C C C C C C C C C C H H H H H H H H H H H H H H H H H H H H H H
charge: 0
multiplicity: 1
keywords: wb97x-d3
keywords: def2-TZVPP
keywords: def2/J RIJCOSX
keywords: DEFGRID2
keywords: scfconv7
keywords: smallprint printgap noloewdin
keywords: NOSOSCF
formula: C17H22N2O4
InChI: InChI=1/C17H22N2O4/c1-6-7-18-9-13(20)19(16(18)22)10-23-15(21)14-12(8-11(2)3)17(14,4)5/h1,8,12,14H,7,9-10H2,2-5H3
45 atoms
O  0.955767 1.071126 -0.426978
O  2.341529 2.20952 -1.742295
O  -0.978392 2.221886 2.009491
O  -2.054351 0.247388 -1.951648
N  -1.277538 1.45127 -0.132252
N  -3.146956 0.30125 0.078857
C  3.578209 0.024342 0.849142
C  2.954361 -1.047515 0.024841
C  3.18871 0.328235 -0.592367
C  5.065902 -0.057135 1.096437
C  2.829245 0.645306 2.002267
C  1.614537 -1.613774 0.32711
C  2.143504 1.288611 -0.977239
C  0.786941 -2.146762 -0.573891
C  -0.528873 -2.740459 -0.174308
C  1.075854 -2.164684 -2.042428
C  -0.097455 1.975959 -0.732257
C  -1.60663 1.596564 1.189765
C  -2.169694 0.598374 -0.796486
C  -2.882508 0.828681 1.394162
C  -4.231857 -0.608127 -0.195368
C  -4.093057 -1.880833 0.5072
C  -3.990055 -2.916982 1.105988
H  3.658936 -1.772639 -0.375557
H  4.028639 0.387535 -1.274926
H  5.489798 0.93331 1.271403
H  5.272399 -0.667023 1.978014
H  5.594108 -0.502852 0.252934
H  3.154151 1.675626 2.157272
H  1.74857 0.65213 1.886619
H  3.05146 0.093235 2.917449
H  1.312051 -1.616913 1.370618
H  -1.345851 -2.293621 -0.744972
H  -0.560365 -3.811949 -0.389292
H  -0.738877 -2.603043 0.886357
H  0.331543 -1.569728 -2.57907
H  2.060054 -1.77299 -2.292646
H  1.005837 -3.179047 -2.442697
H  0.109506 2.963507 -0.32104
H  -0.249609 2.060382 -1.806817
H  -2.7330 0.039905 2.136369
H  -3.680386 1.486912 1.745205
H  -4.283571 -0.777539 -1.270568
H  -5.174848 -0.138685 0.09185
H  -3.905594 -3.847361 1.622039
elementType: O N C H
totalener: -1071.53606656 hartree
nucrepener: 2060.52216766 hartree
electener: -3132.05823422 hartree
oneelecener: -5553.35758310 hartree
twoeener: 2421.29934888 hartree
cpcmener: -0.04975606 hartree
kineticenergy: 1066.87385162 hartree
xcener: -102.629874673429 hartree
chargesum: -0.0000000
charge: -0.249969 -0.500608 -0.476245 -0.516027 -0.101439 -0.123289 0.135790 -0.013350 -0.156722 -0.270155 -0.285185 -0.252615 0.447743 -0.034788 -0.233849 -0.264212 0.049143 0.311116 0.360503 0.008289 -0.043822 -0.442774 0.062004 0.116359 0.097578 0.096604 0.094111 0.088105 0.105030 0.078452 0.101489 0.125126 0.075828 0.114423 0.093322 0.091567 0.094094 0.107333 0.146198 0.133766 0.131443 0.129892 0.135078 0.146162 0.288500
qa: -0.2500 -0.5006 -0.4762 -0.5160 -0.1014 -0.1233 0.1358 -0.0134 -0.1567 -0.2702 -0.2852 -0.2526 0.4477 -0.0348 -0.2338 -0.2642 0.0491 0.3111 0.3605 0.0083 -0.0438 -0.4428 0.0620 0.1164 0.0976 0.0966 0.0941 0.0881 0.1050 0.0785 0.1015 0.1251 0.0758 0.1144 0.0933 0.0916 0.0941 0.1073 0.1462 0.1338 0.1314 0.1299 0.1351 0.1462 0.2885
va: 2.1082 1.9979 2.0289 1.9846 3.1563 3.2056 3.7320 3.7907 3.8905 3.9086 3.9145 3.8312 4.0602 3.7123 3.9142 3.9435 3.9061 4.1651 4.2961 3.8968 3.8721 3.7323 3.5656 1.0045 1.0272 1.0015 1.0018 1.0051 1.0008 1.0086 0.9999 0.9978 1.0016 0.9964 1.0037 1.0079 1.0044 0.9997 0.9975 1.0100 1.0062 1.0066 1.0069 0.9853 0.9457
dispcorr: -0.026430417 hartree
energy: -1071.562496976658
dipole: 13.23684 -15.03096 -1.79413 -13.76563 12.36627 -1.39936 4.53428 -3.04816 1.48612
magnitude: 2.71765 au
magnitude: 6.90773 debye
