program: Orca
programVersion: 5.0.2
elementType: O O O O N N C C C C C C C C C C C C C C C C C H H H H H H H H H H H H H H H H H H H H H H
charge: 0
multiplicity: 1
keywords: wb97x-d3
keywords: def2-TZVPP
keywords: def2/J RIJCOSX
keywords: DEFGRID2
keywords: scfconv7
keywords: smallprint printgap noloewdin
keywords: NOSOSCF
formula: C17H22N2O4
InChI: InChI=1/C17H22N2O4/c1-6-7-18-9-13(20)19(16(18)22)10-23-15(21)14-12(8-11(2)3)17(14,4)5/h1,8,12,14H,7,9-10H2,2-5H3
45 atoms
O  0.346419 0.992743 -0.596523
O  1.034391 -0.99178 -1.38257
O  -2.550459 3.29821 -0.888664
O  -1.820266 -0.979955 0.49844
N  -1.953321 1.119088 -0.460176
N  -3.276684 0.64568 1.241694
C  2.566385 -1.140768 1.326266
C  3.540082 -0.612411 0.332824
C  2.16768 0.045347 0.457261
C  2.795622 -0.801048 2.779999
C  1.915372 -2.488719 1.137167
C  3.956214 -1.371088 -0.873275
C  1.158286 -0.083533 -0.601092
C  4.410773 -0.817656 -1.999849
C  4.845711 -1.655576 -3.162632
C  4.488038 0.662166 -2.215765
C  -0.847838 0.961136 -1.355473
C  -2.677482 2.267396 -0.277317
C  -2.316504 0.123094 0.452779
C  -3.659803 1.969819 0.826424
C  -4.006321 -0.112274 2.224319
C  -5.28776 -0.603053 1.720039
C  -6.341346 -1.001506 1.303367
H  4.318305 0.020755 0.752211
H  2.151295 1.001725 0.966486
H  3.258965 0.178711 2.903681
H  1.854629 -0.797487 3.333907
H  3.451988 -1.538776 3.246533
H  1.824474 -2.798469 0.099861
H  2.502377 -3.250283 1.65467
H  0.914031 -2.494885 1.57255
H  3.911944 -2.454561 -0.813054
H  5.887009 -1.453789 -3.427664
H  4.75028 -2.722501 -2.960812
H  4.251962 -1.427269 -4.052131
H  3.76279 0.976019 -2.971975
H  4.294179 1.241062 -1.31423
H  5.471353 0.951357 -2.5945
H  -0.845237 1.796626 -2.052369
H  -0.948947 0.033196 -1.914436
H  -3.568896 2.701022 1.632934
H  -4.682994 2.008483 0.439835
H  -4.17394 0.515712 3.10174
H  -3.390214 -0.949165 2.555248
H  -7.277719 -1.352052 0.930288
elementType: O N C H
totalener: -1071.54359212 hartree
nucrepener: 1956.24291692 hartree
electener: -3027.78650904 hartree
oneelecener: -5345.56878929 hartree
twoeener: 2317.78228025 hartree
cpcmener: -0.04276811 hartree
kineticenergy: 1066.87508379 hartree
xcener: -102.625342341527 hartree
chargesum: 0.0000000
charge: -0.292666 -0.445296 -0.449420 -0.487978 -0.117282 -0.150006 0.134426 -0.030090 -0.089642 -0.262095 -0.296480 -0.256769 0.379342 -0.022890 -0.225786 -0.267475 0.072077 0.298055 0.390269 -0.002579 -0.057462 -0.427682 0.067611 0.112967 0.093701 0.086251 0.095749 0.093812 0.095694 0.100954 0.096898 0.120653 0.094236 0.088980 0.094007 0.100136 0.092034 0.103046 0.125290 0.142023 0.121912 0.124957 0.140562 0.132778 0.283175
qa: -0.2927 -0.4453 -0.4494 -0.4880 -0.1173 -0.1500 0.1344 -0.0301 -0.0896 -0.2621 -0.2965 -0.2568 0.3793 -0.0229 -0.2258 -0.2675 0.0721 0.2981 0.3903 -0.0026 -0.0575 -0.4277 0.0676 0.1130 0.0937 0.0863 0.0957 0.0938 0.0957 0.1010 0.0969 0.1207 0.0942 0.0890 0.0940 0.1001 0.0920 0.1030 0.1253 0.1420 0.1219 0.1250 0.1406 0.1328 0.2832
va: 2.0932 2.0439 2.0723 2.0318 3.1165 3.1848 3.7495 3.8444 3.8118 3.9009 3.8972 3.8490 4.1111 3.7198 3.9272 3.9451 3.8843 4.2012 4.2979 3.8944 3.9049 3.7431 3.5740 1.0041 1.0309 1.0047 1.0022 1.0024 1.0145 0.9992 1.0076 1.0003 0.9970 1.0072 0.9959 0.9972 1.0055 0.9999 1.0148 1.0163 1.0089 1.0035 0.9857 1.0039 0.9482
dispcorr: -0.021632457 hartree
energy: -1071.565224577728
dipole: 26.75024 -27.54155 -0.79132 -8.90201 9.76720 0.86519 1.05182 0.61391 1.66573
magnitude: 2.03700 au
magnitude: 5.17765 debye
