program: Orca
programVersion: 5.0.2
elementType: O O O O N N C C C C C C C C C C C C C C C C C H H H H H H H H H H H H H H H H H H H H H H
charge: 0
multiplicity: 1
keywords: wb97x-d3
keywords: def2-TZVPP
keywords: def2/J RIJCOSX
keywords: DEFGRID2
keywords: scfconv7
keywords: smallprint printgap noloewdin
keywords: NOSOSCF
formula: C17H22N2O4
InChI: InChI=1/C17H22N2O4/c1-6-7-18-9-13(20)19(16(18)22)10-23-15(21)14-12(8-11(2)3)17(14,4)5/h1,8,12,14H,7,9-10H2,2-5H3
45 atoms
O  0.459319 0.917097 -0.54453
O  1.992897 1.316027 1.036647
O  -1.631329 -0.071254 1.890345
O  -2.481558 2.148185 -1.995906
N  -1.760479 1.230843 0.00514
N  -3.781239 0.733979 -0.724588
C  3.922627 -0.283619 -0.813113
C  3.298177 -1.295848 0.080662
C  2.408648 -0.306991 -0.682484
C  4.440687 -0.768594 -2.147338
C  4.737519 0.854747 -0.251453
C  3.429469 -1.262302 1.557982
C  1.649114 0.717479 0.047456
C  2.577303 -1.84149 2.407448
C  2.794413 -1.791077 3.888671
C  1.332683 -2.549062 1.968169
C  -0.461779 1.817665 0.0512
C  -2.228317 0.327042 0.921631
C  -2.677777 1.44313 -1.033297
C  -3.615798 -0.05028 0.471523
C  -4.959545 0.676815 -1.549897
C  -5.05901 -0.567053 -2.310596
C  -5.141607 -1.593793 -2.928005
H  3.225911 -2.295294 -0.340666
H  1.877529 -0.722258 -1.530846
H  4.441793 0.036662 -2.884702
H  5.466412 -1.130673 -2.050255
H  3.838467 -1.585505 -2.54726
H  4.421488 1.186646 0.733359
H  5.783434 0.550532 -0.174977
H  4.697934 1.717306 -0.919531
H  4.292984 -0.745362 1.965812
H  2.9166 -2.795439 4.303165
H  3.674829 -1.206949 4.156704
H  1.931088 -1.351648 4.395503
H  0.446886 -1.9697 2.242265
H  1.290459 -2.722352 0.894115
H  1.234622 -3.515881 2.467704
H  -0.202344 2.033191 1.085765
H  -0.47029 2.748718 -0.513078
H  -3.673261 -1.12533 0.278967
H  -4.351591 0.202172 1.239328
H  -4.953252 1.527649 -2.231773
H  -5.843337 0.791091 -0.918142
H  -5.230242 -2.50078 -3.483254
elementType: O N C H
totalener: -1071.54466679 hartree
nucrepener: 1951.30910413 hartree
electener: -3022.85377092 hartree
oneelecener: -5335.56637271 hartree
twoeener: 2312.71260179 hartree
cpcmener: -0.04156206 hartree
kineticenergy: 1066.86796918 hartree
xcener: -102.624125774628 hartree
chargesum: -0.0000000
charge: -0.283266 -0.455495 -0.456552 -0.486449 -0.118112 -0.153286 0.136358 -0.031108 -0.104080 -0.262066 -0.298394 -0.261996 0.399596 -0.011757 -0.227281 -0.272704 0.070036 0.305519 0.384131 0.010301 -0.061609 -0.423841 0.066505 0.110494 0.093032 0.095804 0.094217 0.086613 0.094406 0.099310 0.100849 0.120963 0.095057 0.088373 0.094366 0.098363 0.091795 0.103686 0.133167 0.132583 0.125858 0.121729 0.130736 0.140950 0.283196
qa: -0.2833 -0.4555 -0.4566 -0.4864 -0.1181 -0.1533 0.1364 -0.0311 -0.1041 -0.2621 -0.2984 -0.2620 0.3996 -0.0118 -0.2273 -0.2727 0.0700 0.3055 0.3841 0.0103 -0.0616 -0.4238 0.0665 0.1105 0.0930 0.0958 0.0942 0.0866 0.0944 0.0993 0.1008 0.1210 0.0951 0.0884 0.0944 0.0984 0.0918 0.1037 0.1332 0.1326 0.1259 0.1217 0.1307 0.1410 0.2832
va: 2.1052 2.0369 2.0514 2.0391 3.1293 3.1948 3.7459 3.8240 3.8442 3.8987 3.8984 3.8473 4.0901 3.7092 3.9293 3.9456 3.8828 4.1718 4.3144 3.8984 3.9022 3.7416 3.5701 1.0056 1.0304 1.0025 1.0021 1.0045 1.0163 0.9984 1.0001 1.0008 0.9967 1.0073 0.9959 1.0043 1.0057 1.0013 1.0197 1.0071 1.0061 1.0065 1.0061 0.9853 0.9482
dispcorr: -0.021495857 hartree
energy: -1071.566162644890
dipole: 23.34031 -25.03592 -1.69561 -12.37692 11.29290 -1.08402 5.88854 -6.36045 -0.47191
magnitude: 2.06710 au
magnitude: 5.25414 debye
