program: Orca
programVersion: 5.0.2
elementType: O O O O N N C C C C C C C C C C C C C C C C C H H H H H H H H H H H H H H H H H H H H H H
charge: 0
multiplicity: 1
keywords: wb97x-d3
keywords: def2-TZVPP
keywords: def2/J RIJCOSX
keywords: DEFGRID2
keywords: scfconv7
keywords: smallprint printgap noloewdin
keywords: NOSOSCF
formula: C17H22N2O4
InChI: InChI=1/C17H22N2O4/c1-6-7-18-9-13(20)19(16(18)22)10-23-15(21)14-12(8-11(2)3)17(14,4)5/h1,8,12,14H,7,9-10H2,2-5H3
45 atoms
O  0.545256 1.118118 -0.435339
O  1.7461 0.893424 1.444804
O  -1.373994 -0.916305 1.197711
O  -2.632328 2.431779 -1.623063
N  -1.735384 0.947449 -0.087879
N  -3.57479 0.379543 -1.164079
C  4.107908 0.320688 -0.512027
C  3.540888 -1.000496 -0.131779
C  2.607842 0.101702 -0.645449
C  4.846495 0.402292 -1.827462
C  4.668997 1.257141 0.529023
C  3.498566 -1.489789 1.267653
C  1.632297 0.727409 0.256449
C  2.704188 -2.469856 1.70549
C  2.742319 -2.926852 3.131267
C  1.696615 -3.163353 0.841535
C  -0.556927 1.675003 0.261668
C  -2.030912 -0.297714 0.398069
C  -2.669223 1.37147 -1.042237
C  -3.314533 -0.716733 -0.267543
C  -4.774759 0.473548 -1.955144
C  -5.970511 0.665771 -1.136509
C  -6.949231 0.801957 -0.454093
H  3.669277 -1.782334 -0.875647
H  2.250012 -0.027759 -1.660092
H  5.897595 0.13856 -1.692495
H  4.429827 -0.275715 -2.573595
H  4.808131 1.413398 -2.237564
H  4.189935 1.185184 1.501322
H  5.731046 1.046996 0.671961
H  4.585014 2.293008 0.194683
H  4.180754 -1.027379 1.97441
H  3.470806 -2.372688 3.723212
H  1.763759 -2.807579 3.604837
H  2.990033 -3.989658 3.199998
H  1.791642 -4.249437 0.923675
H  0.681507 -2.9179 1.166927
H  1.774991 -2.899261 -0.212194
H  -0.412157 1.639625 1.339415
H  -0.679626 2.711595 -0.045502
H  -3.186103 -1.664412 -0.796203
H  -4.103536 -0.843997 0.479857
H  -4.885553 -0.435505 -2.551603
H  -4.668082 1.298215 -2.661065
H  -7.818533 0.928539 0.152259
elementType: O N C H
totalener: -1071.54450346 hartree
nucrepener: 1947.95495719 hartree
electener: -3019.49946065 hartree
oneelecener: -5328.90970777 hartree
twoeener: 2309.41024711 hartree
cpcmener: -0.04162341 hartree
kineticenergy: 1066.86431430 hartree
xcener: -102.623778957382 hartree
chargesum: -0.0000000
charge: -0.288178 -0.452712 -0.454391 -0.486819 -0.117480 -0.155188 0.135955 -0.034153 -0.103524 -0.260348 -0.298878 -0.249503 0.400302 -0.019883 -0.228077 -0.269300 0.067820 0.305475 0.383886 0.008586 -0.052865 -0.426084 0.062940 0.110869 0.093573 0.094011 0.086529 0.095549 0.093990 0.100225 0.101197 0.122330 0.088193 0.094670 0.093818 0.102632 0.093867 0.090214 0.139621 0.130296 0.123297 0.123189 0.141160 0.129733 0.283457
qa: -0.2882 -0.4527 -0.4544 -0.4868 -0.1175 -0.1552 0.1360 -0.0342 -0.1035 -0.2603 -0.2989 -0.2495 0.4003 -0.0199 -0.2281 -0.2693 0.0678 0.3055 0.3839 0.0086 -0.0529 -0.4261 0.0629 0.1109 0.0936 0.0940 0.0865 0.0955 0.0940 0.1002 0.1012 0.1223 0.0882 0.0947 0.0938 0.1026 0.0939 0.0902 0.1396 0.1303 0.1233 0.1232 0.1412 0.1297 0.2835
va: 2.1034 2.0406 2.0554 2.0411 3.1283 3.1950 3.7548 3.8198 3.8393 3.8979 3.9015 3.8384 4.0979 3.7196 3.9292 3.9425 3.8767 4.1748 4.3163 3.8942 3.8986 3.7353 3.5746 1.0042 1.0306 1.0022 1.0046 1.0025 1.0164 0.9983 1.0000 0.9999 1.0075 0.9958 0.9968 1.0012 1.0060 1.0059 1.0186 1.0130 1.0082 1.0053 0.9849 1.0077 0.9480
dispcorr: -0.021483446 hartree
energy: -1071.565986909122
dipole: 25.14239 -26.29087 -1.14848 -12.51423 11.31956 -1.19467 3.37185 -4.64439 -1.27254
magnitude: 2.08940 au
magnitude: 5.31083 debye
