program: Orca
programVersion: 5.0.2
elementType: O O O O N N C C C C C C C C C C C C C C C C C H H H H H H H H H H H H H H H H H H H H H H
charge: 0
multiplicity: 1
keywords: wb97x-d3
keywords: def2-TZVPP
keywords: def2/J RIJCOSX
keywords: DEFGRID2
keywords: scfconv7
keywords: smallprint printgap noloewdin
keywords: NOSOSCF
formula: C17H22N2O4
InChI: InChI=1/C17H22N2O4/c1-6-7-18-9-13(20)19(16(18)22)10-23-15(21)14-12(8-11(2)3)17(14,4)5/h1,8,12,14H,7,9-10H2,2-5H3
45 atoms
O  0.884501 1.768929 -0.997592
O  1.168987 1.036807 1.093174
O  -1.567093 2.345033 1.995838
O  -1.731922 0.776844 -2.283586
N  -1.353897 1.749685 -0.220087
N  -3.039992 0.342337 -0.435633
C  3.884835 -0.104821 0.12761
C  2.900935 -1.13472 -0.303411
C  2.663239 0.339779 -0.65402
C  5.180389 -0.024296 -0.646254
C  4.057761 0.237303 1.58702
C  2.031484 -1.86938 0.64754
C  1.528953 1.056363 -0.056915
C  0.85736 -2.417465 0.323821
C  0.067015 -3.212985 1.316242
C  0.246484 -2.298127 -1.039272
C  -0.228274 2.548347 -0.606061
C  -1.910522 1.708037 1.033245
C  -2.029175 0.916025 -1.118601
C  -3.053398 0.729324 0.949616
C  -3.942365 -0.633481 -0.988043
C  -3.721591 -1.968187 -0.435215
C  -3.547768 -3.05859 0.03728
H  3.187056 -1.707137 -1.182219
H  2.841951 0.594448 -1.691975
H  5.045787 -0.277724 -1.698839
H  5.605404 0.980246 -0.597368
H  5.916604 -0.716452 -0.232149
H  4.39432 1.269435 1.702152
H  3.158659 0.116042 2.183683
H  4.827651 -0.405746 2.018946
H  2.405664 -2.005322 1.657952
H  -0.16808 -4.207285 0.926613
H  0.597784 -3.338712 2.26024
H  -0.890969 -2.730513 1.530046
H  0.368173 -3.230064 -1.598476
H  -0.828689 -2.123716 -0.969451
H  0.679641 -1.497872 -1.636966
H  0.015279 3.21753 0.218818
H  -0.476552 3.144777 -1.480864
H  -2.875321 -0.115099 1.622269
H  -3.992606 1.207473 1.239307
H  -3.819241 -0.651818 -2.071385
H  -4.973554 -0.327008 -0.79509
H  -3.388074 -4.030244 0.449093
elementType: O N C H
totalener: -1071.54420065 hartree
nucrepener: 2058.05052081 hartree
electener: -3129.59472146 hartree
oneelecener: -5549.23411161 hartree
twoeener: 2419.63939015 hartree
cpcmener: -0.04349980 hartree
kineticenergy: 1066.87758186 hartree
xcener: -102.628445637431 hartree
chargesum: 0.0000000
charge: -0.282640 -0.453632 -0.443154 -0.486193 -0.110966 -0.133588 0.138461 -0.020768 -0.115732 -0.262721 -0.297720 -0.278527 0.399565 0.020029 -0.240957 -0.269452 0.067125 0.297751 0.349951 -0.008125 -0.049219 -0.412532 0.041054 0.114089 0.095183 0.086180 0.095477 0.094352 0.100311 0.095495 0.098165 0.121587 0.099345 0.094037 0.084855 0.119195 0.064932 0.094884 0.132964 0.148828 0.125382 0.125363 0.132377 0.143227 0.285763
qa: -0.2826 -0.4536 -0.4432 -0.4862 -0.1110 -0.1336 0.1385 -0.0208 -0.1157 -0.2627 -0.2977 -0.2785 0.3996 0.0200 -0.2410 -0.2695 0.0671 0.2978 0.3500 -0.0081 -0.0492 -0.4125 0.0411 0.1141 0.0952 0.0862 0.0955 0.0944 0.1003 0.0955 0.0982 0.1216 0.0993 0.0940 0.0849 0.1192 0.0649 0.0949 0.1330 0.1488 0.1254 0.1254 0.1324 0.1432 0.2858
va: 2.1089 2.0414 2.0763 2.0317 3.0874 3.1894 3.7490 3.8183 3.8209 3.8988 3.8945 3.8617 4.1045 3.6528 3.9363 3.9437 3.9054 4.2126 4.3327 3.8876 3.8751 3.7194 3.5995 1.0040 1.0309 1.0045 1.0026 1.0023 1.0008 1.0170 0.9985 1.0030 0.9926 1.0124 0.9938 0.9993 1.0099 1.0138 1.0179 0.9937 1.0033 1.0076 1.0087 0.9849 0.9484
dispcorr: -0.025581371 hartree
energy: -1071.569782018342
dipole: 16.74684 -17.67905 -0.93221 -15.48831 14.61752 -0.87080 2.27270 -2.81697 -0.54426
magnitude: 1.38691 au
magnitude: 3.52526 debye
