program: Orca
programVersion: 5.0.2
elementType: O O O O N N C C C C C C C C C C C C C C C C C H H H H H H H H H H H H H H H H H H H H H H
charge: 0
multiplicity: 1
keywords: wb97x-d3
keywords: def2-TZVPP
keywords: def2/J RIJCOSX
keywords: DEFGRID2
keywords: scfconv7
keywords: smallprint printgap noloewdin
keywords: NOSOSCF
formula: C17H22N2O4
InChI: InChI=1/C17H22N2O4/c1-6-7-18-9-13(20)19(16(18)22)10-23-15(21)14-12(8-11(2)3)17(14,4)5/h1,8,12,14H,7,9-10H2,2-5H3
45 atoms
O  1.082093 1.271898 -0.014285
O  1.577832 1.623687 -2.168102
O  -1.404259 1.687217 2.459302
O  -1.60607 0.860679 -2.015539
N  -1.231805 1.511468 0.173319
N  -3.088664 0.416927 -0.309158
C  3.817814 -0.07393 0.193701
C  2.813529 -1.150325 -0.032074
C  2.859585 0.049633 -0.981325
C  5.246986 -0.366427 -0.202086
C  3.728235 0.841258 1.390221
C  1.685414 -1.410038 0.895156
C  1.790825 1.050709 -1.126405
C  0.578646 -2.086568 0.578869
C  -0.500623 -2.323569 1.589636
C  0.2982 -2.613951 -0.794318
C  0.00616 2.19381 -0.035852
C  -1.828956 1.320806 1.392914
C  -1.958824 0.90692 -0.859838
C  -3.113925 0.583118 1.121025
C  -4.01956 -0.42343 -1.018361
C  -3.804446 -1.843566 -0.745984
C  -3.602415 -3.002369 -0.501652
H  3.205225 -2.041993 -0.514908
H  3.311189 -0.155102 -1.94515
H  5.781819 0.553226 -0.448215
H  5.780649 -0.85064 0.618496
H  5.304831 -1.026081 -1.068892
H  4.15257 1.81962 1.156208
H  2.720502 0.999322 1.76358
H  4.314786 0.421362 2.21019
H  1.785988 -1.039082 1.910733
H  -0.271021 -1.866826 2.55264
H  -1.453977 -1.917924 1.242304
H  -0.666925 -3.392174 1.752014
H  1.15634 -2.558058 -1.462264
H  -0.030781 -3.655376 -0.75689
H  -0.515493 -2.051005 -1.260753
H  0.158922 2.892867 0.783113
H  -0.035827 2.74721 -0.970935
H  -3.123007 -0.370835 1.655109
H  -3.971775 1.171931 1.456274
H  -3.928629 -0.228306 -2.087197
H  -5.037281 -0.146173 -0.736624
H  -3.439201 -4.035647 -0.290863
elementType: O N C H
totalener: -1071.54154531 hartree
nucrepener: 2074.09018370 hartree
electener: -3145.63172901 hartree
oneelecener: -5580.67257783 hartree
twoeener: 2435.04084882 hartree
cpcmener: -0.04518206 hartree
kineticenergy: 1066.87595186 hartree
xcener: -102.628358390440 hartree
chargesum: -0.0000000
charge: -0.261292 -0.458226 -0.448349 -0.479787 -0.091268 -0.134879 0.139960 -0.030295 -0.150404 -0.266695 -0.289805 -0.229249 0.426278 -0.006653 -0.232295 -0.284054 0.047857 0.287868 0.361965 -0.029171 -0.035593 -0.395309 0.021154 0.110486 0.092618 0.096442 0.093259 0.086706 0.103586 0.088382 0.098016 0.123161 0.098238 0.049284 0.112147 0.098071 0.104037 0.087622 0.128029 0.143041 0.133857 0.136393 0.132925 0.140204 0.281738
qa: -0.2613 -0.4582 -0.4483 -0.4798 -0.0913 -0.1349 0.1400 -0.0303 -0.1504 -0.2667 -0.2898 -0.2292 0.4263 -0.0067 -0.2323 -0.2841 0.0479 0.2879 0.3620 -0.0292 -0.0356 -0.3953 0.0212 0.1105 0.0926 0.0964 0.0933 0.0867 0.1036 0.0884 0.0980 0.1232 0.0982 0.0493 0.1121 0.0981 0.1040 0.0876 0.1280 0.1430 0.1339 0.1364 0.1329 0.1402 0.2817
va: 2.0963 2.0543 2.0656 2.0376 3.1046 3.1749 3.7377 3.7969 3.8596 3.9030 3.9029 3.8177 4.1261 3.6475 3.9345 3.9508 3.8803 4.1680 4.3118 3.9064 3.8949 3.7178 3.6280 1.0044 1.0289 1.0017 1.0023 1.0056 1.0003 1.0137 0.9992 1.0019 1.0135 0.9939 0.9982 1.0118 0.9978 1.0032 1.0128 1.0226 0.9922 1.0102 1.0054 0.9861 0.9512
dispcorr: -0.026951761 hartree
energy: -1071.568497073919
dipole: 14.41233 -15.73604 -1.32370 -13.66202 12.58905 -1.07297 6.08190 -4.78814 1.29377
magnitude: 2.13946 au
magnitude: 5.43808 debye
