program: Orca
programVersion: 5.0.2
elementType: O O O O N N C C C C C C C C C C C C C C C C C H H H H H H H H H H H H H H H H H H H H H H
charge: 0
multiplicity: 1
keywords: wb97x-d3
keywords: def2-TZVPP
keywords: def2/J RIJCOSX
keywords: DEFGRID2
keywords: scfconv7
keywords: smallprint printgap noloewdin
keywords: NOSOSCF
formula: C17H22N2O4
InChI: InChI=1/C17H22N2O4/c1-6-7-18-9-13(20)19(16(18)22)10-23-15(21)14-12(8-11(2)3)17(14,4)5/h1,8,12,14H,7,9-10H2,2-5H3
45 atoms
O  0.792821 1.851814 -1.033253
O  1.222417 1.330156 1.094345
O  -1.558525 2.317527 2.038183
O  -1.629771 0.216092 -2.00785
N  -1.361993 1.512301 -0.111591
N  -2.54221 -0.347284 0.031396
C  3.934783 0.209961 0.15406
C  2.985196 -0.819675 -0.360795
C  2.73994 0.673533 -0.647521
C  5.252746 0.331926 -0.577017
C  4.072961 0.488552 1.631198
C  2.071356 -1.5959 0.506055
C  1.548108 1.306577 -0.066021
C  1.155911 -2.466684 0.066987
C  0.289897 -3.226038 1.025103
C  0.885935 -2.747417 -1.379743
C  -0.436687 2.454176 -0.668533
C  -1.789513 1.492148 1.192868
C  -1.840494 0.413391 -0.832388
C  -2.627865 0.248469 1.338026
C  -3.270718 -1.531719 -0.339251
C  -4.708881 -1.291753 -0.445299
C  -5.891987 -1.096343 -0.513645
H  3.319977 -1.343893 -1.250182
H  2.941012 0.975152 -1.669053
H  5.151433 0.124714 -1.643362
H  5.66743 1.336465 -0.47135
H  5.981933 -0.372613 -0.171729
H  4.401357 1.516413 1.796322
H  3.164305 0.341398 2.206209
H  4.838005 -0.168617 2.049966
H  2.163231 -1.45894 1.57836
H  0.486516 -2.958614 2.063321
H  -0.76968 -3.042442 0.824242
H  0.438169 -4.30419 0.919633
H  -0.074873 -2.319021 -1.679013
H  1.640351 -2.345031 -2.053395
H  0.814375 -3.822201 -1.56165
H  -0.294556 3.26135 0.049743
H  -0.8316 2.869825 -1.592074
H  -2.219488 -0.400314 2.117275
H  -3.653195 0.513019 1.612575
H  -3.084722 -2.31263 0.401937
H  -2.883176 -1.904512 -1.288014
H  -6.942937 -0.92296 -0.578876
elementType: O N C H
totalener: -1071.54315406 hartree
nucrepener: 2048.99256654 hartree
electener: -3120.53572061 hartree
oneelecener: -5530.67536295 hartree
twoeener: 2410.13964234 hartree
cpcmener: -0.04314794 hartree
kineticenergy: 1066.87090764 hartree
xcener: -102.626118248145 hartree
chargesum: 0.0000000
charge: -0.279827 -0.455381 -0.440799 -0.486534 -0.120198 -0.136171 0.143755 -0.046167 -0.100315 -0.262214 -0.288440 -0.241799 0.397092 -0.044189 -0.226779 -0.256815 0.076922 0.295391 0.361034 -0.005043 -0.110697 -0.450828 0.127809 0.110691 0.093875 0.086689 0.095677 0.094931 0.100913 0.091797 0.097094 0.127443 0.091595 0.080351 0.102458 0.087154 0.093972 0.099670 0.133825 0.145752 0.123153 0.128034 0.145054 0.135257 0.284810
qa: -0.2798 -0.4554 -0.4408 -0.4865 -0.1202 -0.1362 0.1438 -0.0462 -0.1003 -0.2622 -0.2884 -0.2418 0.3971 -0.0442 -0.2268 -0.2568 0.0769 0.2954 0.3610 -0.0050 -0.1107 -0.4508 0.1278 0.1107 0.0939 0.0867 0.0957 0.0949 0.1009 0.0918 0.0971 0.1274 0.0916 0.0804 0.1025 0.0872 0.0940 0.0997 0.1338 0.1458 0.1232 0.1280 0.1451 0.1353 0.2848
va: 2.1105 2.0419 2.0799 2.0326 3.0971 3.1683 3.7700 3.7920 3.8410 3.8943 3.8872 3.8410 4.1226 3.7311 3.9275 3.9409 3.8989 4.2069 4.3165 3.8802 3.9441 3.8986 3.4890 1.0042 1.0305 1.0042 1.0028 1.0024 0.9999 1.0217 0.9998 1.0030 1.0082 0.9942 0.9987 1.0055 1.0095 1.0000 1.0161 0.9934 1.0076 1.0063 0.9775 1.0017 0.9471
dispcorr: -0.024727918 hartree
energy: -1071.567881981289
dipole: 18.99809 -19.38623 -0.38814 -15.93263 14.52013 -1.41250 1.36244 -1.63593 -0.27349
magnitude: 1.49017 au
magnitude: 3.78771 debye
