program: Orca
programVersion: 5.0.2
elementType: O O O O N N C C C C C C C C C C C C C C C C C H H H H H H H H H H H H H H H H H H H H H H
charge: 0
multiplicity: 1
keywords: wb97x-d3
keywords: def2-TZVPP
keywords: def2/J RIJCOSX
keywords: DEFGRID2
keywords: scfconv7
keywords: smallprint printgap noloewdin
keywords: NOSOSCF
formula: C17H22N2O4
InChI: InChI=1/C17H22N2O4/c1-6-7-18-9-13(20)19(16(18)22)10-23-15(21)14-12(8-11(2)3)17(14,4)5/h1,8,12,14H,7,9-10H2,2-5H3
45 atoms
O  0.53303 0.945901 0.182511
O  1.981373 0.41745 1.793568
O  -1.98236 3.32165 0.210063
O  -2.06773 -1.237552 0.23067
N  -1.735877 1.044272 0.442535
N  -3.401683 0.318609 -0.820433
C  4.201352 0.444655 -0.351146
C  3.453385 -0.797838 -0.700036
C  2.700566 0.522848 -0.50037
C  4.975869 1.104964 -1.470144
C  4.881977 0.591496 0.988211
C  3.274613 -1.926492 0.245433
C  1.758074 0.620824 0.631365
C  2.282472 -2.815316 0.17664
C  2.169206 -3.938529 1.160752
C  1.192756 -2.759502 -0.84942
C  -0.500462 0.994421 1.150912
C  -2.336625 2.198275 -0.006313
C  -2.379193 -0.106164 -0.028777
C  -3.540484 1.748901 -0.810827
C  -4.42056 -0.569924 -1.312069
C  -5.675005 -0.443983 -0.573335
C  -6.699665 -0.311648 0.035704
H  3.507252 -1.090097 -1.745568
H  2.336049 0.987914 -1.409366
H  5.094054 2.173976 -1.285122
H  5.972911 0.669098 -1.555368
H  4.482503 0.988347 -2.436188
H  4.976909 1.646046 1.251395
H  4.359448 0.100628 1.802341
H  5.890127 0.176513 0.927572
H  4.00807 -2.030421 1.03786
H  2.184734 -4.907896 0.656279
H  2.975834 -3.925625 1.892391
H  1.22181 -3.883139 1.70215
H  1.324524 -1.956416 -1.571969
H  1.131548 -3.70125 -1.400573
H  0.221075 -2.612991 -0.372107
H  -0.486901 0.110461 1.787082
H  -0.410963 1.887463 1.769683
H  -4.464703 2.077248 -0.323763
H  -3.512303 2.183317 -1.813508
H  -4.041446 -1.58986 -1.237808
H  -4.599018 -0.373484 -2.37286
H  -7.60738 -0.209304 0.580344
totalener: -1071.51657675 hartree
nucrepener: 1958.35121463 hartree
electener: -3029.86779138 hartree
oneelecener: -5348.86835347 hartree
twoeener: 2319.00056209 hartree
kineticenergy: 1066.94708676 hartree
xcener: -102.627696908367 hartree
chargesum: 0.0000000
charge: -0.265828 -0.374038 -0.337047 -0.399567 -0.146845 -0.166993 0.147740 -0.061039 -0.098326 -0.243563 -0.274616 -0.184328 0.337715 -0.003796 -0.208988 -0.255638 0.077282 0.232255 0.360797 -0.027753 -0.085411 -0.401356 0.104936 0.089304 0.079140 0.091470 0.088263 0.069320 0.086842 0.101916 0.086986 0.084854 0.081554 0.077546 0.090987 0.074607 0.091431 0.105172 0.130170 0.127466 0.110977 0.103190 0.130772 0.123712 0.248726
qa: -0.2658 -0.3740 -0.3370 -0.3996 -0.1468 -0.1670 0.1477 -0.0610 -0.0983 -0.2436 -0.2746 -0.1843 0.3377 -0.0038 -0.2090 -0.2556 0.0773 0.2323 0.3608 -0.0278 -0.0854 -0.4014 0.1049 0.0893 0.0791 0.0915 0.0883 0.0693 0.0868 0.1019 0.0870 0.0849 0.0816 0.0775 0.0910 0.0746 0.0914 0.1052 0.1302 0.1275 0.1110 0.1032 0.1308 0.1237 0.2487
va: 2.0976 2.1120 2.1797 2.1129 3.1326 3.1384 3.7410 3.8963 3.8522 3.9037 3.9084 3.8816 4.1664 3.7566 3.9396 3.9492 3.9153 4.2560 4.3013 3.8897 3.9181 3.7798 3.6366 1.0067 1.0307 1.0050 1.0050 1.0070 1.0052 1.0202 0.9975 1.0137 0.9988 1.0109 0.9993 1.0095 1.0026 1.0073 1.0052 1.0021 1.0085 1.0109 1.0097 0.9842 0.9706
dispcorr: -0.021905354 hartree
energy: -1071.538482106332
dipole: 23.49229 -24.52360 -1.03132 -12.10623 11.96986 -0.13637 -4.00050 2.83624 -1.16426
magnitude: 1.56132 au
magnitude: 3.96855 debye
