program: Orca
programVersion: 5.0.2
elementType: O O O O N N C C C C C C C C C C C C C C C C C H H H H H H H H H H H H H H H H H H H H H H
charge: 0
multiplicity: 1
keywords: wb97x-d3
keywords: def2-TZVPP
keywords: def2/J RIJCOSX
keywords: DEFGRID2
keywords: scfconv7
keywords: smallprint printgap noloewdin
keywords: NOSOSCF
formula: C17H22N2O4
InChI: InChI=1/C17H22N2O4/c1-6-7-18-9-13(20)19(16(18)22)10-23-15(21)14-12(8-11(2)3)17(14,4)5/h1,8,12,14H,7,9-10H2,2-5H3
45 atoms
O  0.390829 1.364972 -0.700175
O  1.805678 1.334717 1.042616
O  -1.31655 0.032252 1.710552
O  -2.84412 2.665662 -1.680084
N  -1.787065 1.564156 0.061617
N  -3.855056 0.986509 -0.468125
C  3.612019 -0.496374 -0.645432
C  2.544057 -1.438825 -0.18506
C  2.160026 -0.116069 -0.83579
C  4.340756 -0.851696 -1.921067
C  4.491192 0.209538 0.357176
C  2.245802 -1.709829 1.245743
C  1.483159 0.922679 -0.03503
C  3.000493 -2.468221 2.040688
C  2.607524 -2.728647 3.463142
C  4.278369 -3.116465 1.603013
C  -0.511721 2.209853 -0.020764
C  -2.056414 0.50513 0.89435
C  -2.845525 1.830874 -0.816195
C  -3.468268 0.06502 0.56377
C  -5.062746 0.853362 -1.237959
C  -5.143959 -0.43389 -1.92452
C  -5.202081 -1.506293 -2.458481
H  2.366598 -2.286225 -0.843933
H  1.779906 -0.193956 -1.847689
H  4.730969 0.04274 -2.409826
H  5.187152 -1.508968 -1.710674
H  3.694977 -1.36458 -2.635463
H  4.011636 0.364407 1.317599
H  5.3921 -0.38466 0.5231
H  4.806194 1.181813 -0.025312
H  1.330304 -1.29218 1.651697
H  3.386753 -2.391948 4.151554
H  1.68246 -2.21978 3.729726
H  2.471172 -3.797636 3.645888
H  4.518009 -2.922688 0.559044
H  5.117683 -2.76748 2.209741
H  4.228379 -4.199811 1.739574
H  -0.153488 2.444784 0.980097
H  -0.636762 3.124294 -0.597205
H  -3.468232 -0.973726 0.219145
H  -4.106535 0.128607 1.449571
H  -5.089875 1.66928 -1.961461
H  -5.935595 0.974013 -0.589576
H  -5.255136 -2.449605 -2.946864
totalener: -1071.51471021 hartree
nucrepener: 1948.13403451 hartree
electener: -3019.64874473 hartree
oneelecener: -5328.63697425 hartree
twoeener: 2308.98822952 hartree
kineticenergy: 1066.94378271 hartree
xcener: -102.628214163100 hartree
chargesum: -0.0000000
charge: -0.274931 -0.361126 -0.348383 -0.384158 -0.137270 -0.171588 0.074301 -0.054321 -0.064545 -0.241293 -0.258520 -0.168629 0.324704 -0.031517 -0.211971 -0.253728 0.058046 0.238784 0.344641 -0.018252 -0.082847 -0.398352 0.100265 0.098167 0.084442 0.093250 0.082543 0.072726 0.116293 0.076475 0.094156 0.111015 0.081835 0.086881 0.081035 0.077843 0.092335 0.095356 0.141379 0.119926 0.110022 0.103044 0.130228 0.123365 0.248376
qa: -0.2749 -0.3611 -0.3484 -0.3842 -0.1373 -0.1716 0.0743 -0.0543 -0.0645 -0.2413 -0.2585 -0.1686 0.3247 -0.0315 -0.2120 -0.2537 0.0580 0.2388 0.3446 -0.0183 -0.0828 -0.3984 0.1003 0.0982 0.0844 0.0933 0.0825 0.0727 0.1163 0.0765 0.0942 0.1110 0.0818 0.0869 0.0810 0.0778 0.0923 0.0954 0.1414 0.1199 0.1100 0.1030 0.1302 0.1234 0.2484
va: 2.1055 2.1315 2.1674 2.1427 3.1033 3.1415 3.7190 3.8835 3.8273 3.9040 3.9009 3.8894 4.1789 3.7503 3.9386 3.9352 3.9014 4.2407 4.3395 3.8891 3.9102 3.7820 3.6376 1.0038 1.0299 1.0049 1.0067 1.0075 1.0166 0.9994 1.0063 1.0127 0.9992 1.0121 0.9975 1.0085 0.9978 1.0038 1.0149 1.0128 1.0121 1.0082 1.0118 0.9833 0.9708
dispcorr: -0.021976091 hartree
energy: -1071.536686303213
dipole: 28.29707 -29.19229 -0.89522 -17.81162 16.92483 -0.88679 5.68396 -5.98978 -0.30582
magnitude: 1.29667 au
magnitude: 3.29586 debye
