program: Orca
programVersion: 5.0.2
elementType: O O O O N N C C C C C C C C C C C C C C C C C H H H H H H H H H H H H H H H H H H H H H H
charge: 0
multiplicity: 1
keywords: wb97x-d3
keywords: def2-TZVPP
keywords: def2/J RIJCOSX
keywords: DEFGRID2
keywords: scfconv7
keywords: smallprint printgap noloewdin
keywords: NOSOSCF
formula: C17H22N2O4
InChI: InChI=1/C17H22N2O4/c1-6-7-18-9-13(20)19(16(18)22)10-23-15(21)14-12(8-11(2)3)17(14,4)5/h1,8,12,14H,7,9-10H2,2-5H3
45 atoms
O  0.249371 1.011727 -0.337585
O  1.905045 1.432578 1.10445
O  -1.946678 -0.040346 1.996724
O  -2.541445 2.514618 -1.730927
N  -1.940678 1.423334 0.221989
N  -3.935044 1.032358 -0.647035
C  3.689046 -0.265908 -0.787375
C  3.007219 -1.316433 0.033873
C  2.184689 -0.210147 -0.631855
C  4.168044 -0.679852 -2.159825
C  4.596239 0.748464 -0.135955
C  3.143657 -1.420641 1.498301
C  1.484148 0.822032 0.158095
C  3.386302 -2.540426 2.185003
C  3.469218 -2.510334 3.682689
C  3.594185 -3.898558 1.585259
C  -0.607545 1.913623 0.339737
C  -2.473476 0.45496 1.042126
C  -2.791201 1.743431 -0.844589
C  -3.851529 0.156698 0.488522
C  -5.006732 0.984584 -1.60458
C  -5.151032 -0.339685 -2.205341
C  -5.27381 -1.440074 -2.666613
H  2.878963 -2.265799 -0.474189
H  1.617394 -0.534816 -1.496222
H  4.226604 0.181011 -2.828381
H  5.163356 -1.124035 -2.100723
H  3.505688 -1.413049 -2.622395
H  4.645529 1.657788 -0.737283
H  4.292437 1.033292 0.865634
H  5.605447 0.337643 -0.075058
H  3.025444 -0.506044 2.065712
H  4.445271 -2.855315 4.033701
H  3.301218 -1.511202 4.082146
H  2.725122 -3.176296 4.127581
H  2.853742 -4.606798 1.965568
H  3.541204 -3.916234 0.499093
H  4.572987 -4.293442 1.868684
H  -0.344709 1.991418 1.393565
H  -0.552661 2.896874 -0.12624
H  -3.92865 -0.898967 0.21099
H  -4.617454 0.365524 1.24133
H  -4.802555 1.729174 -2.375239
H  -5.949492 1.269883 -1.12781
H  -5.38397 -2.408413 -3.092901
totalener: -1071.51720534 hartree
nucrepener: 1909.55485251 hartree
electener: -2981.07205784 hartree
oneelecener: -5251.25070048 hartree
twoeener: 2270.17864264 hartree
kineticenergy: 1066.93427528 hartree
xcener: -102.627594291130 hartree
chargesum: -0.0000000
charge: -0.268276 -0.394459 -0.335338 -0.381991 -0.147266 -0.170055 0.098751 0.025227 -0.102420 -0.239203 -0.251275 -0.213944 0.368257 -0.049631 -0.204473 -0.243845 0.076827 0.230727 0.341703 -0.022055 -0.082146 -0.399283 0.100864 0.084493 0.083469 0.089822 0.088420 0.070241 0.087034 0.103666 0.084112 0.109010 0.080097 0.082650 0.083000 0.087691 0.075619 0.085952 0.132305 0.121127 0.109994 0.103268 0.129635 0.123297 0.248404
qa: -0.2683 -0.3945 -0.3353 -0.3820 -0.1473 -0.1701 0.0988 0.0252 -0.1024 -0.2392 -0.2513 -0.2139 0.3683 -0.0496 -0.2045 -0.2438 0.0768 0.2307 0.3417 -0.0221 -0.0821 -0.3993 0.1009 0.0845 0.0835 0.0898 0.0884 0.0702 0.0870 0.1037 0.0841 0.1090 0.0801 0.0827 0.0830 0.0877 0.0756 0.0860 0.1323 0.1211 0.1100 0.1033 0.1296 0.1233 0.2484
va: 2.1163 2.0941 2.1797 2.1441 3.1226 3.1368 3.7307 3.8055 3.9036 3.9109 3.9185 3.9085 4.1316 3.8153 3.9393 3.9459 3.9028 4.2574 4.3434 3.8895 3.9083 3.7847 3.6370 1.0117 1.0293 1.0050 1.0040 1.0081 1.0028 1.0194 1.0022 1.0262 0.9979 1.0128 0.9982 0.9988 1.0160 0.9994 1.0120 1.0041 1.0122 1.0074 1.0122 0.9832 0.9708
dispcorr: -0.019781544 hartree
energy: -1071.536986879450
dipole: 28.69757 -29.68058 -0.98301 -16.92590 16.06055 -0.86535 3.96578 -4.47742 -0.51164
magnitude: 1.40603 au
magnitude: 3.57384 debye
