program: Orca
programVersion: 5.0.2
elementType: O O O O N N C C C C C C C C C C C C C C C C C H H H H H H H H H H H H H H H H H H H H H H
charge: 0
multiplicity: 1
keywords: wb97x-d3
keywords: def2-TZVPP
keywords: def2/J RIJCOSX
keywords: DEFGRID2
keywords: scfconv7
keywords: smallprint printgap noloewdin
keywords: NOSOSCF
formula: C17H22N2O4
InChI: InChI=1/C17H22N2O4/c1-6-7-18-9-13(20)19(16(18)22)10-23-15(21)14-12(8-11(2)3)17(14,4)5/h1,8,12,14H,7,9-10H2,2-5H3
45 atoms
O  0.269716 1.279822 1.444945
O  -0.352989 -0.792625 0.876973
O  2.045385 2.373397 -0.780758
O  2.580149 -1.803429 0.96365
N  2.204982 0.416439 0.409391
N  2.763088 -1.008149 -1.189166
C  -2.329734 1.273474 -0.704542
C  -3.027052 0.21562 0.092961
C  -1.920246 1.015794 0.736922
C  -3.012293 2.593584 -0.963154
C  -1.41404 0.849742 -1.827723
C  -4.42809 0.346163 0.562124
C  -0.62505 0.375296 1.023101
C  -5.036095 -0.507701 1.39094
C  -6.47068 -0.325183 1.782489
C  -4.363186 -1.70037 1.997623
C  1.611662 0.861037 1.636924
C  2.298681 1.194106 -0.714415
C  2.524622 -0.920263 0.137278
C  2.766161 0.289674 -1.819288
C  3.422376 -2.147165 -1.782958
C  4.877042 -2.011019 -1.812984
C  6.071634 -1.890639 -1.852434
H  -2.730887 -0.796156 -0.168252
H  -2.201296 1.796433 1.435929
H  -3.607065 2.935297 -0.116749
H  -2.27134 3.366616 -1.174027
H  -3.671596 2.523838 -1.830672
H  -1.978017 0.780362 -2.759664
H  -0.620382 1.584186 -1.979614
H  -0.94844 -0.12099 -1.659644
H  -5.00028 1.189952 0.188289
H  -7.068232 -1.193509 1.492925
H  -6.572095 -0.230568 2.86654
H  -6.91469 0.557402 1.322569
H  -3.305948 -1.776467 1.748876
H  -4.445502 -1.669145 3.086994
H  -4.852115 -2.625313 1.680737
H  2.131818 1.738421 2.011132
H  1.688415 0.064144 2.375045
H  2.085533 0.338139 -2.671534
H  3.763472 0.590066 -2.154349
H  3.046843 -2.278222 -2.798806
H  3.140967 -3.044925 -1.233038
H  7.133057 -1.786453 -1.886024
elementType: O N C H
totalener: -1071.53845239 hartree
nucrepener: 1980.40503294 hartree
electener: -3051.94348533 hartree
oneelecener: -5393.56139925 hartree
twoeener: 2341.61791392 hartree
cpcmener: -0.05139765 hartree
kineticenergy: 1066.86422848 hartree
xcener: -102.624904284080 hartree
chargesum: -0.0000000
charge: -0.277553 -0.475013 -0.472968 -0.506037 -0.117533 -0.153264 0.167262 -0.058636 -0.085715 -0.301367 -0.274799 -0.266168 0.409265 -0.027515 -0.231634 -0.249850 0.070931 0.294615 0.389419 0.003765 -0.042344 -0.441262 0.064594 0.101175 0.102212 0.089988 0.099758 0.104102 0.105844 0.093448 0.090570 0.127404 0.094588 0.094683 0.088836 0.077896 0.095982 0.098896 0.151655 0.139334 0.126019 0.135266 0.142462 0.133650 0.288040
qa: -0.2776 -0.4750 -0.4730 -0.5060 -0.1175 -0.1533 0.1673 -0.0586 -0.0857 -0.3014 -0.2748 -0.2662 0.4093 -0.0275 -0.2316 -0.2499 0.0709 0.2946 0.3894 0.0038 -0.0423 -0.4413 0.0646 0.1012 0.1022 0.0900 0.0998 0.1041 0.1058 0.0934 0.0906 0.1274 0.0946 0.0947 0.0888 0.0779 0.0960 0.0989 0.1517 0.1393 0.1260 0.1353 0.1425 0.1336 0.2880
va: 2.1175 2.0179 2.0288 2.0101 3.1085 3.1793 3.7458 3.8508 3.8225 3.9076 3.8777 3.8805 4.1558 3.7171 3.9295 3.9403 3.8943 4.1732 4.3054 3.9058 3.9011 3.7503 3.5710 1.0185 1.0280 1.0016 1.0022 0.9980 1.0016 1.0100 1.0122 1.0034 0.9953 0.9961 1.0071 1.0217 0.9979 0.9979 0.9923 1.0149 1.0065 1.0050 0.9865 1.0040 0.9450
dispcorr: -0.022975814 hartree
energy: -1071.561428202860
dipole: -31.05376 31.03324 -0.02052 1.52802 -1.08329 0.44473 -2.14954 0.73369 -1.41585
magnitude: 1.48420 au
magnitude: 3.77253 debye
