program: Orca
programVersion: 5.0.2
elementType: O O O O N N C C C C C C C C C C C C C C C C C H H H H H H H H H H H H H H H H H H H H H H
charge: 0
multiplicity: 1
keywords: wb97x-d3
keywords: def2-TZVPP
keywords: def2/J RIJCOSX
keywords: DEFGRID2
keywords: scfconv7
keywords: smallprint printgap noloewdin
keywords: NOSOSCF
formula: C17H22N2O4
InChI: InChI=1/C17H22N2O4/c1-6-7-18-9-13(20)19(16(18)22)10-23-15(21)14-12(8-11(2)3)17(14,4)5/h1,8,12,14H,7,9-10H2,2-5H3
45 atoms
O  0.208301 1.03472 1.489796
O  -0.383563 -1.013865 0.81223
O  2.017022 2.374989 -0.567055
O  2.560914 -1.961206 0.725473
N  2.164363 0.301476 0.407363
N  2.723325 -0.946707 -1.334083
C  -2.299193 1.118973 -0.750748
C  -3.02994 0.029242 -0.030755
C  -1.956136 0.790635 0.695832
C  -2.988651 2.441401 -0.974573
C  -1.334827 0.753662 -1.852791
C  -4.457662 0.17313 0.358307
C  -0.668347 0.144924 0.999666
C  -4.987067 -0.214014 1.521642
C  -6.448811 -0.046545 1.804706
C  -4.196792 -0.842876 2.627156
C  1.553543 0.619451 1.665597
C  2.268365 1.19518 -0.626793
C  2.491715 -0.99651 -0.002575
C  2.745968 0.413395 -1.816893
C  3.433743 -2.001783 -2.02021
C  4.884054 -1.878056 -1.895722
C  6.073484 -1.748167 -1.790635
H  -2.737873 -0.974738 -0.331294
H  -2.267715 1.536184 1.420097
H  -3.657423 2.707078 -0.155848
H  -2.255171 3.243063 -1.076242
H  -3.578807 2.416292 -1.892903
H  -0.562505 1.517894 -1.96255
H  -0.839976 -0.204266 -1.693371
H  -1.866405 0.687334 -2.803887
H  -5.119047 0.602109 -0.389777
H  -6.977104 0.426395 0.977223
H  -6.922372 -1.011702 2.001258
H  -6.606292 0.561015 2.699409
H  -4.252188 -0.23716 3.535276
H  -4.615919 -1.818762 2.88505
H  -3.14671 -0.988023 2.381395
H  2.056081 1.466367 2.124213
H  1.636272 -0.240579 2.328248
H  2.08322 0.56129 -2.67109
H  3.751824 0.739522 -2.098847
H  3.151338 -1.979198 -3.07305
H  3.101733 -2.965034 -1.634189
H  7.131472 -1.640124 -1.701456
elementType: O N C H
totalener: -1071.53838319 hartree
nucrepener: 1991.47318124 hartree
electener: -3063.01156444 hartree
oneelecener: -5415.63979998 hartree
twoeener: 2352.62823555 hartree
cpcmener: -0.05196695 hartree
kineticenergy: 1066.87069577 hartree
xcener: -102.625109989083 hartree
chargesum: 0.0000000
charge: -0.276647 -0.471262 -0.471660 -0.503320 -0.113814 -0.158172 0.165643 -0.001630 -0.151753 -0.288783 -0.283287 -0.305987 0.414912 -0.024448 -0.230113 -0.233118 0.073379 0.295777 0.390999 -0.004294 -0.036878 -0.438053 0.055355 0.103080 0.108987 0.094146 0.098738 0.099891 0.091960 0.088202 0.107029 0.125531 0.089617 0.096866 0.094677 0.098255 0.101886 0.079277 0.150905 0.139013 0.127496 0.137996 0.141271 0.134319 0.288010
qa: -0.2766 -0.4713 -0.4717 -0.5033 -0.1138 -0.1582 0.1656 -0.0016 -0.1518 -0.2888 -0.2833 -0.3060 0.4149 -0.0244 -0.2301 -0.2331 0.0734 0.2958 0.3910 -0.0043 -0.0369 -0.4381 0.0554 0.1031 0.1090 0.0941 0.0987 0.0999 0.0920 0.0882 0.1070 0.1255 0.0896 0.0969 0.0947 0.0983 0.1019 0.0793 0.1509 0.1390 0.1275 0.1380 0.1413 0.1343 0.2880
va: 2.1153 2.0247 2.0300 2.0130 3.1070 3.1704 3.7075 3.8088 3.8258 3.8961 3.8927 3.8839 4.1562 3.7226 3.9300 3.9264 3.8907 4.1664 4.3014 3.9084 3.9083 3.7404 3.5805 1.0234 1.0243 1.0024 1.0036 0.9994 1.0087 1.0129 1.0013 1.0029 1.0062 0.9959 0.9970 0.9992 0.9994 1.0189 0.9931 1.0149 1.0061 1.0048 0.9874 1.0020 0.9451
dispcorr: -0.023702045 hartree
energy: -1071.562085236635
dipole: -30.33087 30.30470 -0.02617 4.01970 -3.30516 0.71454 -1.04108 -0.31442 -1.35550
magnitude: 1.53252 au
magnitude: 3.89536 debye
