program: Orca
programVersion: 5.0.2
elementType: O O O O N N C C C C C C C C C C C C C C C C C H H H H H H H H H H H H H H H H H H H H H H
charge: 0
multiplicity: 1
keywords: wb97x-d3
keywords: def2-TZVPP
keywords: def2/J RIJCOSX
keywords: DEFGRID2
keywords: scfconv7
keywords: smallprint printgap noloewdin
keywords: NOSOSCF
formula: C17H22N2O4
InChI: InChI=1/C17H22N2O4/c1-6-7-18-9-13(20)19(16(18)22)10-23-15(21)14-12(8-11(2)3)17(14,4)5/h1,8,12,14H,7,9-10H2,2-5H3
45 atoms
O  0.201911 1.052491 1.485283
O  -0.383224 -0.997379 0.80413
O  2.023515 2.377903 -0.57723
O  2.561443 -1.94586 0.760458
N  2.164582 0.313233 0.417376
N  2.737723 -0.950747 -1.307637
C  -2.305124 1.141552 -0.749797
C  -3.034033 0.04493 -0.038592
C  -1.961608 0.80243 0.693989
C  -2.993057 2.466201 -0.964179
C  -1.341073 0.781978 -1.854213
C  -4.461022 0.180376 0.356736
C  -0.671544 0.159979 0.994753
C  -4.987015 -0.2483 1.50708
C  -6.447791 -0.092528 1.801981
C  -4.192026 -0.918264 2.585249
C  1.546904 0.640951 1.66974
C  2.27286 1.197132 -0.625025
C  2.496171 -0.988703 0.022064
C  2.750557 0.403524 -1.807606
C  3.437827 -2.016408 -1.986677
C  4.890935 -1.891034 -1.885237
C  6.084532 -1.773992 -1.817952
H  -2.739592 -0.955621 -0.348095
H  -2.276735 1.541437 1.423404
H  -2.25732 3.265128 -1.071307
H  -3.592468 2.446115 -1.876573
H  -3.651973 2.732936 -0.137881
H  -1.872733 0.722904 -2.805717
H  -0.566539 1.544561 -1.958818
H  -0.849222 -0.178514 -1.700731
H  -5.123413 0.63801 -0.373427
H  -6.919771 -1.065099 1.963113
H  -6.602123 0.479894 2.720219
H  -6.979778 0.411551 0.995417
H  -4.253515 -0.353356 3.519055
H  -4.602374 -1.908369 2.799931
H  -3.140411 -1.042865 2.334515
H  2.045987 1.492135 2.124345
H  1.627497 -0.213625 2.339806
H  2.079813 0.536446 -2.658371
H  3.75215 0.731333 -2.101066
H  3.141508 -2.011278 -3.036769
H  3.110585 -2.973528 -1.580479
H  7.14436 -1.658678 -1.763735
elementType: O N C H
totalener: -1071.53836097 hartree
nucrepener: 1990.24446105 hartree
electener: -3061.78282201 hartree
oneelecener: -5413.18334486 hartree
twoeener: 2351.40052285 hartree
cpcmener: -0.05189027 hartree
kineticenergy: 1066.86121423 hartree
xcener: -102.623505168623 hartree
chargesum: 0.0000000
charge: -0.276420 -0.471637 -0.471866 -0.504241 -0.114857 -0.156551 0.167944 -0.003967 -0.150781 -0.289153 -0.283831 -0.304533 0.415972 -0.024935 -0.229788 -0.233503 0.072916 0.295044 0.390854 -0.002385 -0.041614 -0.441824 0.062756 0.103333 0.108115 0.098450 0.100077 0.094170 0.106968 0.092220 0.088466 0.125479 0.096720 0.094708 0.089655 0.097877 0.101859 0.078661 0.150742 0.139047 0.127467 0.137674 0.141532 0.135009 0.288171
qa: -0.2764 -0.4716 -0.4719 -0.5042 -0.1149 -0.1566 0.1679 -0.0040 -0.1508 -0.2892 -0.2838 -0.3045 0.4160 -0.0249 -0.2298 -0.2335 0.0729 0.2950 0.3909 -0.0024 -0.0416 -0.4418 0.0628 0.1033 0.1081 0.0985 0.1001 0.0942 0.1070 0.0922 0.0885 0.1255 0.0967 0.0947 0.0897 0.0979 0.1019 0.0787 0.1507 0.1390 0.1275 0.1377 0.1415 0.1350 0.2882
va: 2.1159 2.0239 2.0299 2.0121 3.1074 3.1710 3.7078 3.8110 3.8245 3.8961 3.8928 3.8836 4.1541 3.7228 3.9299 3.9270 3.8913 4.1678 4.3017 3.9071 3.9043 3.7448 3.5752 1.0232 1.0249 1.0036 0.9993 1.0024 1.0013 1.0089 1.0125 1.0027 0.9959 0.9970 1.0062 0.9993 0.9993 1.0197 0.9930 1.0148 1.0058 1.0049 0.9872 1.0019 0.9448
dispcorr: -0.023651600 hartree
energy: -1071.562012564663
dipole: -30.37507 30.33675 -0.03832 3.81247 -3.12485 0.68762 -1.13274 -0.22935 -1.36209
magnitude: 1.52630 au
magnitude: 3.87953 debye
