program: Orca
programVersion: 5.0.2
elementType: O O O O N N C C C C C C C C C C C C C C C C C H H H H H H H H H H H H H H H H H H H H H H
charge: 0
multiplicity: 1
keywords: wb97x-d3
keywords: def2-TZVPP
keywords: def2/J RIJCOSX
keywords: DEFGRID2
keywords: scfconv7
keywords: smallprint printgap noloewdin
keywords: NOSOSCF
formula: C17H22N2O4
InChI: InChI=1/C17H22N2O4/c1-6-7-18-9-13(20)19(16(18)22)10-23-15(21)14-12(8-11(2)3)17(14,4)5/h1,8,12,14H,7,9-10H2,2-5H3
45 atoms
O  0.220466 1.401079 0.487212
O  -0.506978 3.437601 1.024105
O  2.803299 0.069699 2.41449
O  2.093767 0.641916 -2.042806
N  2.386949 0.72568 0.250124
N  3.344858 -0.912547 -0.887138
C  -2.678683 1.373719 -0.784357
C  -2.41285 0.305519 0.23836
C  -2.106953 1.748839 0.572638
C  -4.093226 1.82344 -1.054627
C  -1.803176 1.418519 -2.013078
C  -3.494663 -0.388438 0.965122
C  -0.742209 2.289274 0.7194
C  -3.597025 -1.706861 1.166678
C  -4.74869 -2.275659 1.940683
C  -2.619802 -2.730717 0.673247
C  1.567074 1.863696 0.495241
C  2.882554 -0.105786 1.223685
C  2.560775 0.178653 -1.025526
C  3.527444 -1.256076 0.503957
C  3.46353 -1.905937 -1.930691
C  2.377438 -2.88233 -1.888866
C  1.483041 -3.680626 -1.812399
H  -1.544514 -0.303101 0.015245
H  -2.81084 2.255431 1.224856
H  -4.095894 2.823332 -1.492222
H  -4.577814 1.151351 -1.765599
H  -4.708088 1.857687 -0.156408
H  -1.696397 2.441627 -2.379257
H  -0.805907 1.014087 -1.849717
H  -2.261272 0.831789 -2.811449
H  -4.273398 0.244953 1.380697
H  -5.424886 -1.501394 2.302648
H  -5.327763 -2.970608 1.327079
H  -4.397121 -2.847378 2.803521
H  -3.131262 -3.482755 0.06733
H  -1.811219 -2.320141 0.071597
H  -2.170463 -3.268078 1.512459
H  1.726224 2.608038 -0.283679
H  1.833405 2.291832 1.460276
H  4.580593 -1.347916 0.775022
H  3.020167 -2.188038 0.771324
H  4.421922 -2.414373 -1.818492
H  3.491954 -1.406231 -2.898639
H  0.686807 -4.388564 -1.748874
elementType: O N C H
totalener: -1071.53994587 hartree
nucrepener: 1973.73262707 hartree
electener: -3045.27257294 hartree
oneelecener: -5379.48477385 hartree
twoeener: 2334.21220090 hartree
cpcmener: -0.05083408 hartree
kineticenergy: 1066.86017458 hartree
xcener: -102.622693210299 hartree
chargesum: 0.0000000
charge: -0.267476 -0.489864 -0.470755 -0.509862 -0.127695 -0.166727 0.088883 0.078062 -0.114640 -0.275656 -0.256527 -0.301351 0.429380 -0.050875 -0.221823 -0.248847 0.063625 0.317684 0.404898 0.005552 -0.033240 -0.427351 0.044779 0.095479 0.096638 0.098533 0.097053 0.089658 0.101203 0.072546 0.097664 0.123468 0.089253 0.094053 0.093543 0.095964 0.086605 0.097583 0.148492 0.133537 0.126800 0.127638 0.141750 0.135773 0.286593
qa: -0.2675 -0.4899 -0.4708 -0.5099 -0.1277 -0.1667 0.0889 0.0781 -0.1146 -0.2757 -0.2565 -0.3014 0.4294 -0.0509 -0.2218 -0.2488 0.0636 0.3177 0.4049 0.0056 -0.0332 -0.4274 0.0448 0.0955 0.0966 0.0985 0.0971 0.0897 0.1012 0.0725 0.0977 0.1235 0.0893 0.0941 0.0935 0.0960 0.0866 0.0976 0.1485 0.1335 0.1268 0.1276 0.1418 0.1358 0.2866
va: 2.1117 2.0059 2.0410 2.0003 3.1656 3.2041 3.7203 3.7212 3.8732 3.9095 3.9062 3.8609 4.1288 3.7625 3.9218 3.9451 3.8918 4.1646 4.2858 3.9023 3.9067 3.7366 3.5957 1.0211 1.0313 1.0015 1.0015 1.0057 1.0013 1.0214 1.0018 1.0091 1.0086 0.9961 0.9961 0.9975 1.0098 0.9964 0.9981 1.0070 1.0081 1.0060 0.9873 1.0015 0.9465
dispcorr: -0.021599986 hartree
energy: -1071.561545860342
dipole: -27.31404 28.06316 0.74912 -10.41877 7.77400 -2.64476 -2.83148 2.05209 -0.77939
magnitude: 2.85717 au
magnitude: 7.26234 debye
