program: Orca
programVersion: 5.0.2
elementType: O O O O N N C C C C C C C C C C C C C C C C C H H H H H H H H H H H H H H H H H H H H H H
charge: 0
multiplicity: 1
keywords: wb97x-d3
keywords: def2-TZVPP
keywords: def2/J RIJCOSX
keywords: DEFGRID2
keywords: scfconv7
keywords: smallprint printgap noloewdin
keywords: NOSOSCF
formula: C17H22N2O4
InChI: InChI=1/C17H22N2O4/c1-6-7-18-9-13(20)19(16(18)22)10-23-15(21)14-12(8-11(2)3)17(14,4)5/h1,8,12,14H,7,9-10H2,2-5H3
45 atoms
O  0.251132 1.349732 0.519927
O  -0.484481 3.418028 0.898348
O  2.893108 0.084133 2.396597
O  2.195843 0.670518 -2.062172
N  2.438711 0.727596 0.237451
N  3.546803 -0.802067 -0.910293
C  -2.659961 1.111718 -0.657917
C  -2.424451 0.233985 0.536003
C  -2.08222 1.698462 0.622821
C  -4.068801 1.537855 -0.986537
C  -1.797437 0.915166 -1.879539
C  -3.549925 -0.290478 1.350235
C  -0.716843 2.246171 0.694783
C  -4.086126 -1.506163 1.213508
C  -5.225103 -1.955142 2.076805
C  -3.621205 -2.507201 0.20144
C  1.588395 1.840866 0.486751
C  2.993445 -0.071449 1.204619
C  2.680093 0.223896 -1.045336
C  3.734859 -1.157076 0.476634
C  3.810548 -1.736894 -1.97889
C  2.859997 -2.845093 -2.001329
C  2.088038 -3.764977 -2.007412
H  -1.577389 -0.436605 0.428414
H  -2.782468 2.318299 1.173534
H  -4.062743 2.450361 -1.585697
H  -4.577802 0.764794 -1.566371
H  -4.665915 1.73118 -0.095726
H  -1.664322 1.852243 -2.423986
H  -0.811452 0.512826 -1.654619
H  -2.28482 0.210741 -2.556531
H  -3.967135 0.376669 2.099228
H  -6.097259 -2.211121 1.469825
H  -4.963681 -2.857438 2.635552
H  -5.525099 -1.190117 2.792447
H  -2.799382 -2.149237 -0.416547
H  -3.299897 -3.431454 0.687991
H  -4.441892 -2.782367 -0.465853
H  1.711901 2.577512 -0.305584
H  1.862728 2.290912 1.439704
H  4.787814 -1.171447 0.762714
H  3.298002 -2.130401 0.718371
H  4.823286 -2.123249 -1.862822
H  3.791385 -1.204648 -2.929027
H  1.404855 -4.583623 -2.001411
elementType: O N C H
totalener: -1071.53911994 hartree
nucrepener: 1955.14813258 hartree
electener: -3026.68725252 hartree
oneelecener: -5342.37107396 hartree
twoeener: 2315.68382144 hartree
cpcmener: -0.05063315 hartree
kineticenergy: 1066.87404168 hartree
xcener: -102.624821934539 hartree
chargesum: 0.0000000
charge: -0.267832 -0.493360 -0.471949 -0.511213 -0.123838 -0.165731 0.142135 0.027472 -0.140309 -0.274021 -0.288195 -0.287320 0.434093 -0.032397 -0.230952 -0.250842 0.063411 0.317741 0.405575 0.006420 -0.043840 -0.436381 0.061155 0.104622 0.096248 0.100192 0.096405 0.093106 0.104393 0.078733 0.097908 0.123956 0.094785 0.095251 0.090070 0.087212 0.100454 0.097038 0.143232 0.135395 0.126429 0.127801 0.142898 0.135256 0.288796
qa: -0.2678 -0.4934 -0.4719 -0.5112 -0.1238 -0.1657 0.1421 0.0275 -0.1403 -0.2740 -0.2882 -0.2873 0.4341 -0.0324 -0.2310 -0.2508 0.0634 0.3177 0.4056 0.0064 -0.0438 -0.4364 0.0612 0.1046 0.0962 0.1002 0.0964 0.0931 0.1044 0.0787 0.0979 0.1240 0.0948 0.0953 0.0901 0.0872 0.1005 0.0970 0.1432 0.1354 0.1264 0.1278 0.1429 0.1353 0.2888
va: 2.1116 2.0032 2.0396 1.9990 3.1638 3.2075 3.6698 3.7617 3.9394 3.9073 3.9119 3.8570 4.1234 3.7035 3.9276 3.9412 3.8926 4.1655 4.2846 3.9019 3.9037 3.7517 3.5767 1.0148 1.0327 1.0026 1.0018 1.0018 1.0001 1.0182 1.0021 1.0072 0.9961 0.9954 1.0075 1.0083 0.9984 0.9974 1.0011 1.0050 1.0080 1.0058 0.9862 1.0020 0.9447
dispcorr: -0.021644933 hartree
energy: -1071.560764877754
dipole: -30.00165 30.76520 0.76356 -10.65088 8.01186 -2.63902 -3.05636 2.27584 -0.78052
magnitude: 2.85599 au
magnitude: 7.25935 debye
