program: Gaussian 09
title: 000074809
version: EM64L-G09RevD.01
frameworkgroup: C1[X(C14H10O2)]
method: RPBEPBE
basis: SDD
operation: Freq
keyword: #pfreq=noraman
keyword: PBEPBE/SDD
title: #p freq=noraman PBEPBE/SDD
converged: YES YES NO NO
title: Mulliken charges:
elementType: O O C C C C C C C C C C C C C C H H H H H H H H H H
charge: -0.418367 -0.203048 -0.480010 0.249261 0.291037 0.174675 0.169207 -0.412356 -0.406785 -0.393437 -0.393356 0.184335 -0.232899 -0.239906 -0.232436 -0.232517 0.288607 0.270755 0.246764 0.241802 0.240403 0.227933 0.227731 0.227373 0.227285 0.377950
chargesum: 0.00000
title: Mulliken charges with hydrogens summed into heavy atoms:
elementType: O O C C C C C C C C C C C C C C
charge: -0.040417 -0.203048 -0.191403 0.249261 0.291037 0.174675 0.169207 -0.141601 -0.160021 -0.151636 -0.152952 0.184335 -0.004966 -0.012176 -0.005063 -0.005232
polarizability: 2.22322053e+02 4.31098404e+00 1.65648155e+02 3.42190508e+00 -1.38213160e+01 7.51126127e+01
1716.lowfreq: -4.3979 -0.0005 -0.0005 -0.0004 3.0048 4.1513 37.0822 67.9867 105.1943
frequency: 37.0581 67.9858 105.1911 109.6403 149.7683 200.5563 277.7230 284.5805 340.7774 410.6675 421.0097 442.3637 467.4965 501.5692 522.2049 566.9554 590.3411 612.0978 622.1288 651.1077 691.3563 716.7192 745.2022 748.3868 756.2872 791.0256 845.6168 852.4747 884.5443 888.2686 916.3295 950.9346 957.6447 987.2196 990.1349 996.0424 1022.4619 1030.6718 1040.6557 1094.7450 1110.6748 1154.5871 1166.4867 1171.9389 1181.1025 1189.1358 1225.5981 1249.2869 1284.1050 1302.7280 1312.1600 1378.1151 1403.3799 1438.8948 1444.9880 1468.4568 1484.7195 1592.3398 1594.2628 1616.3479 1623.1139 1672.6332 2991.0888 3125.7387 3126.6459 3135.5987 3138.1054 3147.3925 3151.2698 3164.1462 3165.5050 3509.1444
redmass: 11.5771 4.9380 5.4174 5.3171 4.0038 4.6766 5.5692 4.6716 7.0042 6.1916 3.0970 2.9550 4.7670 4.1139 3.6307 3.3546 3.3078 3.0192 3.0863 3.6957 3.9924 4.5409 1.8762 3.0832 1.5113 2.0599 2.7493 2.9158 1.8609 1.6307 4.8706 1.4555 1.4431 1.3387 1.3230 6.3387 2.2679 2.0870 2.3913 2.0618 1.7052 1.2479 1.3639 1.1092 1.5999 1.7272 1.6913 1.9655 1.6875 1.8512 2.0104 9.0172 3.7645 2.2392 2.7851 2.6541 4.0099 6.7388 6.9034 7.3068 7.2296 8.9324 1.0813 1.0854 1.0854 1.0895 1.0900 1.0952 1.0948 1.1004 1.1002 1.0640
irintensity: 0.6729 0.3567 3.0696 0.7218 0.3424 0.8935 0.7050 0.2174 5.0075 0.8533 7.0909 0.9515 4.0602 3.7270 14.5462 0.1532 50.6808 25.3136 53.0083 39.3629 24.7707 0.4877 0.8525 36.9311 133.2973 1.0633 4.8838 9.4889 9.4086 1.2009 22.0138 0.8804 5.5362 0.4162 0.8532 4.5308 0.8519 16.3382 256.8189 11.7897 2.5913 3.9730 1.0686 0.8502 3.1468 10.4116 2.2977 3.8706 19.3729 4.6663 33.3304 3.6921 2.3046 24.8648 18.6654 12.1165 1.9629 1.0163 1.1391 3.0443 4.7196 204.0780 1.4698 3.3198 0.1172 6.6013 5.0635 23.3480 24.3512 44.6374 15.8031 26.3306
temp: 298.150 k
press: 1.00000 atm
elementType: 8 8 6 6 6 6 6 6 6 6 6 6 6 6 6 6 1 1 1 1 1 1 1 1 1 1
symmnumber: 1
zpe: 520421.2 jmol-1
zpe.correction: 0.198218 hartree
zpe.thermalcorrener: 0.210375 hartree
zpe.thermalcorrenthalpy: 0.211319 hartree
zpe.thermalcorrgfe: 0.159032 hartree
zpe.sumelectzpe: -688.869490 hartree
zpe.sumelectthermal: -688.857333 hartree
zpe.sumelectthermalent: -688.856389 hartree
zpe.sumelectthermalfe: -688.908676 hartree
dipole: -0.8644 -0.2095 -1.0749
dipole: 1.3952
quadrupole: -79.8124 -78.2347 -99.1056
quadrupole: -4.1022 -3.1339 -5.5283
quadrupole: 5.9052 7.4829 -13.3880 -4.1022 -3.1339 -5.5283
hfenergy: -689.0677079 hartree
pointgroup: C01 [X(C14H10O2)]
dipole: 0.3440147 -0.056681 0.4239704 debye
dipolederiv: -0.7034449 -0.4050922 -0.1868926 -0.4068635 -0.8763309 -0.2947054 -0.1242109 -0.2222478 -0.3962094 -0.514944 -0.1069768 -0.2237244 0.0643058 -0.6521784 0.2059969 -0.3578648 0.2218194 -0.6776828 0.0258716 0.1337511 -0.0747965 0.04491 -0.3481084 0.1076511 -0.0169349 0.0497597 0.0548286 -0.067765 -0.2769356 0.0348113 -0.2544944 0.1083347 0.0227888 -0.0657483 0.1558263 -0.0618996 -0.0793061 0.1618798 0.0045489 0.2099172 0.0382329 0.0170252 0.0594702 0.0729459 -0.0437692 0.2802918 -0.0437369 -0.0458405 0.0384576 -0.0797828 -0.007532 -0.0000786 -0.0188467 0.0035956 0.2251324 0.0705806 0.0201312 -0.0457994 -0.0586896 -0.00669 -0.0218612 -0.0157504 0.0102794 0.0137476 0.0904087 -0.0006384 0.1042038 0.0340237 0.0541632 0.0207472 0.0388297 -0.1326037 0.0325105 -0.0885339 -0.0198923 -0.1117694 0.1010749 0.0570977 -0.0180986 0.012596 -0.1226804 -0.1036745 0.0499305 0.0212076 0.0581158 0.0526992 0.0606647 0.0176157 0.0457973 -0.1340708 -0.0939073 -0.0536369 -0.0148644 -0.0308721 0.0633717 0.0564859 -0.0018258 0.0547375 -0.1376332 0.7513735 0.4507263 0.5223671 0.3360692 1.4620125 -0.1562923 0.5382348 -0.3225151 0.857753 -0.0179745 0.0153081 0.0076598 0.0985167 -0.0433351 0.0313745 0.0234811 0.0227341 -0.1612699 -0.0225869 -0.0232093 0.0064415 -0.1111576 -0.0451093 0.0354593 -0.0085807 0.0287976 -0.1572444 -0.0118425 -0.0695975 -0.0248017 -0.1664357 0.0307185 0.0541474 -0.0472307 0.049056 -0.1363032 -0.0054161 0.0766359 0.0257533 0.1842455 0.0212576 0.0408883 0.045788 0.0458504 -0.1413669 0.0187791 -0.0097143 -0.0057246 -0.0086719 0.048273 -0.061686 0.0005413 -0.0522206 0.0043123 0.0831811 -0.0457437 0.0030524 -0.0753663 -0.0217269 -0.0473301 -0.0122818 -0.0387831 0.1416213 0.0773642 0.0269691 0.0040422 0.0683957 -0.0705122 -0.0574148 0.0057532 -0.0459835 0.1322951 0.0648207 -0.0830603 -0.0232133 -0.0457718 -0.064189 -0.0504845 -0.0097185 -0.0559318 0.1405104 0.0740619 0.0773875 0.0200143 0.0351279 -0.0704897 -0.0548625 0.0086615 -0.0566173 0.1395945 -0.138674 -0.018424 -0.0071992 -0.0292159 0.0833899 -0.0179735 -0.0040569 -0.0198037 0.1564818 -0.1330409 0.0353041 0.012378 0.0442609 0.0809478 -0.0180571 0.0063106 -0.0198666 0.1567502 -0.0255015 0.1038706 0.0271236 0.1211754 -0.0303613 -0.0467973 0.0329052 -0.0474065 0.1448816 -0.0431891 -0.1046838 -0.0241693 -0.1206911 -0.015179 -0.0420496 -0.0314497 -0.0431763 0.1468065 0.3141329 0.0365929 -0.057774 -0.0005924 0.2516562 0.118132 -0.0395675 0.1603993 0.2130229 unknown
polarizability: 222.6233967|0.3667448|165.1353733|2.8745256|14.6557344|75.3240513 unknown
InChI: InChI=1S/C14H10O2/c15-14(16)13-11-7-3-1-5-9(11)10-6-2-4-8-12(10)13/h1-8,13,15H
charge 0 multiplicity 1
26 atoms
O  1.066332 3.286383 0.246145
O  -0.614009 2.72014 -1.254444
C  0.005384 1.159871 0.596313
C  1.177053 0.201055 0.311483
C  -1.216737 0.28166 0.344575
C  0.667021 -1.089579 -0.019895
C  -0.807597 -1.041355 0.005232
C  2.55839 0.445598 0.363766
C  -2.577328 0.61698 0.424963
C  1.554881 -2.151238 -0.299438
C  -1.769696 -2.043809 -0.245309
C  0.069943 2.425303 -0.256007
C  3.446701 -0.623193 0.080626
C  -3.54305 -0.389212 0.171642
C  2.947625 -1.908345 -0.246995
C  -3.140706 -1.707682 -0.157846
H  0.050815 1.490257 1.653602
H  2.938182 1.441151 0.614768
H  -2.894035 1.637614 0.665097
H  1.176821 -3.147678 -0.553808
H  -1.466183 -3.063891 -0.50569
H  4.528585 -0.453907 0.115512
H  -4.609803 -0.145753 0.225878
H  3.64942 -2.721712 -0.462977
H  -3.90168 -2.472203 -0.350724
H  1.123971 4.090543 -0.338473
