program: Orca
programVersion: 5.0.2
elementType: O O O O N N C C C C C C C C C C C C C C C C C H H H H H H H H H H H H H H H H H H H H H H
charge: 0
multiplicity: 1
keywords: wb97x-d3
keywords: def2-TZVPP
keywords: def2/J RIJCOSX
keywords: DEFGRID2
keywords: scfconv7
keywords: smallprint printgap noloewdin
keywords: NOSOSCF
formula: C17H22N2O4
InChI: InChI=1/C17H22N2O4/c1-6-7-18-9-13(20)19(16(18)22)10-23-15(21)14-12(8-11(2)3)17(14,4)5/h1,8,12,14H,7,9-10H2,2-5H3
45 atoms
O  0.081852 0.665997 1.39136
O  0.122538 2.761838 0.608984
O  3.025471 2.328543 -0.290662
O  1.648874 -1.952111 0.459102
N  2.173737 0.298805 0.391925
N  2.655587 -0.96416 -1.36375
C  -2.305632 0.681472 -0.695314
C  -2.709105 0.309523 0.704573
C  -1.90469 1.561952 0.478921
C  -3.334369 1.261117 -1.633193
C  -1.268828 -0.169884 -1.388356
C  -4.111559 0.432118 1.168815
C  -0.483836 1.7391 0.825355
C  -4.94149 -0.589532 1.396958
C  -6.345848 -0.355016 1.863592
C  -4.573672 -2.028113 1.202679
C  1.486254 0.662238 1.594668
C  2.828661 1.151122 -0.462663
C  2.116322 -0.999534 -0.126098
C  3.270689 0.31419 -1.630435
C  3.077586 -2.164538 -2.04814
C  4.428109 -2.574684 -1.670555
C  5.545622 -2.885547 -1.35821
H  -2.157307 -0.532618 1.108477
H  -2.449864 2.499002 0.530977
H  -3.909744 0.462925 -2.106742
H  -4.037146 1.921986 -1.127002
H  -2.851769 1.83548 -2.426093
H  -1.764531 -0.861547 -2.072148
H  -0.579741 0.436638 -1.980273
H  -0.686427 -0.774512 -0.696062
H  -4.486738 1.440329 1.320594
H  -6.56528 0.704739 1.991509
H  -7.067874 -0.766662 1.153642
H  -6.53245 -0.85633 2.816871
H  -3.551107 -2.174788 0.859948
H  -4.702183 -2.590919 2.130643
H  -5.237348 -2.492724 0.468791
H  1.859471 1.622032 1.944661
H  1.669349 -0.085019 2.361184
H  2.932552 0.74891 -2.572215
H  4.363239 0.254357 -1.6499
H  3.031791 -1.986701 -3.123129
H  2.366884 -2.963172 -1.83727
H  6.533438 -3.1782 -1.07972
elementType: O N C H
totalener: -1071.53882519 hartree
nucrepener: 1977.65930570 hartree
electener: -3049.19813089 hartree
oneelecener: -5387.60053548 hartree
twoeener: 2338.40240459 hartree
cpcmener: -0.05538757 hartree
kineticenergy: 1066.86895589 hartree
xcener: -102.624987248581 hartree
chargesum: -0.0000000
charge: -0.269899 -0.477123 -0.468788 -0.503913 -0.089493 -0.149281 0.155647 0.035675 -0.154561 -0.272013 -0.301915 -0.301645 0.430522 -0.026217 -0.229752 -0.252895 0.054533 0.315930 0.352496 -0.002058 -0.036490 -0.440299 0.059786 0.102318 0.098700 0.095125 0.091333 0.100391 0.101902 0.107309 0.086395 0.123949 0.089863 0.094548 0.094731 0.088602 0.097577 0.096847 0.134989 0.144419 0.126141 0.132883 0.141755 0.134473 0.287500
qa: -0.2699 -0.4771 -0.4688 -0.5039 -0.0895 -0.1493 0.1556 0.0357 -0.1546 -0.2720 -0.3019 -0.3016 0.4305 -0.0262 -0.2298 -0.2529 0.0545 0.3159 0.3525 -0.0021 -0.0365 -0.4403 0.0598 0.1023 0.0987 0.0951 0.0913 0.1004 0.1019 0.1073 0.0864 0.1239 0.0899 0.0945 0.0947 0.0886 0.0976 0.0968 0.1350 0.1444 0.1261 0.1329 0.1418 0.1345 0.2875
va: 2.1188 2.0222 2.0399 2.0051 3.1035 3.1822 3.6611 3.7409 3.9112 3.9037 3.9187 3.8628 4.1600 3.7095 3.9262 3.9445 3.9137 4.1679 4.2981 3.8947 3.9045 3.7479 3.5788 1.0191 1.0322 1.0028 1.0025 1.0016 1.0018 0.9984 1.0152 1.0075 1.0077 0.9961 0.9956 1.0088 0.9977 0.9972 1.0148 1.0026 1.0108 1.0049 0.9871 1.0027 0.9454
dispcorr: -0.023175100 hartree
energy: -1071.562000289459
dipole: -31.68470 31.58493 -0.09977 -6.84759 5.12693 -1.72066 -3.43203 1.97894 -1.45309
magnitude: 2.25435 au
magnitude: 5.73010 debye
