program: Orca
programVersion: 5.0.2
elementType: O O O O N N C C C C C C C C C C C C C C C C C H H H H H H H H H H H H H H H H H H H H H H
charge: 0
multiplicity: 1
keywords: wb97x-d3
keywords: def2-TZVPP
keywords: def2/J RIJCOSX
keywords: DEFGRID2
keywords: scfconv7
keywords: smallprint printgap noloewdin
keywords: NOSOSCF
formula: C17H22N2O4
InChI: InChI=1/C17H22N2O4/c1-6-7-18-9-13(20)19(16(18)22)10-23-15(21)14-12(8-11(2)3)17(14,4)5/h1,8,12,14H,7,9-10H2,2-5H3
45 atoms
O  0.177972 0.616836 0.083275
O  -0.923145 2.556389 0.086319
O  2.21895 -0.093133 -2.568901
O  3.017804 0.201423 1.90488
N  2.422794 0.361638 -0.326496
N  4.0957 -0.965844 0.233116
C  -3.070043 0.787979 1.597051
C  -3.501302 1.066461 0.200264
C  -2.110369 0.505094 0.447055
C  -3.5914 -0.439167 2.304515
C  -2.827232 1.947449 2.530781
C  -4.524913 0.256264 -0.505456
C  -0.935492 1.349861 0.192402
C  -4.69318 0.231968 -1.830446
C  -5.790091 -0.568492 -2.461748
C  -3.824501 0.98996 -2.785766
C  1.38439 1.324579 -0.184755
C  2.746191 -0.272331 -1.498228
C  3.178171 -0.123108 0.74851
C  3.872785 -1.211681 -1.170718
C  4.921753 -1.827354 1.04361
C  4.349431 -3.161278 1.210779
C  3.882301 -4.262022 1.324797
H  -3.491078 2.120146 -0.065829
H  -1.965398 -0.54618 0.226183
H  -4.564968 -0.237603 2.755507
H  -3.701848 -1.294754 1.638832
H  -2.911487 -0.732128 3.106213
H  -2.048174 1.709995 3.257419
H  -2.544074 2.862929 2.016136
H  -3.74129 2.160075 3.088177
H  -5.200722 -0.330067 0.110232
H  -6.455837 0.072908 -3.044919
H  -5.38603 -1.307282 -3.158543
H  -6.39251 -1.095121 -1.721967
H  -2.995214 1.504292 -2.302215
H  -3.406796 0.317612 -3.539397
H  -4.409138 1.735467 -3.331486
H  1.304007 1.897511 -1.10769
H  1.630233 1.999858 0.633394
H  3.569927 -2.24365 -1.370177
H  4.753392 -0.988376 -1.776336
H  5.076266 -1.3590 2.015491
H  5.906502 -1.908495 0.579924
H  3.466478 -5.239307 1.429913
elementType: O N C H
totalener: -1071.54087895 hartree
nucrepener: 1904.63095730 hartree
electener: -2976.17183625 hartree
oneelecener: -5241.74988726 hartree
twoeener: 2265.57805101 hartree
cpcmener: -0.04883257 hartree
kineticenergy: 1066.86047297 hartree
xcener: -102.623566045492 hartree
chargesum: -0.0000000
charge: -0.278800 -0.501011 -0.474155 -0.513750 -0.127871 -0.162857 0.153312 -0.040458 -0.072743 -0.292803 -0.272672 -0.281173 0.409788 -0.014040 -0.228610 -0.246667 0.079154 0.319844 0.406974 0.005257 -0.044562 -0.430480 0.057545 0.099955 0.093707 0.102103 0.091985 0.099397 0.101621 0.091669 0.097261 0.126477 0.095127 0.095215 0.090030 0.079334 0.096560 0.101268 0.134144 0.137378 0.127059 0.126945 0.133274 0.142307 0.287964
qa: -0.2788 -0.5010 -0.4742 -0.5138 -0.1279 -0.1629 0.1533 -0.0405 -0.0727 -0.2928 -0.2727 -0.2812 0.4098 -0.0140 -0.2286 -0.2467 0.0792 0.3198 0.4070 0.0053 -0.0446 -0.4305 0.0575 0.1000 0.0937 0.1021 0.0920 0.0994 0.1016 0.0917 0.0973 0.1265 0.0951 0.0952 0.0900 0.0793 0.0966 0.1013 0.1341 0.1374 0.1271 0.1269 0.1333 0.1423 0.2880
va: 2.1118 1.9933 2.0378 2.0028 3.1574 3.2041 3.7220 3.8291 3.8312 3.9169 3.8840 3.8827 4.0942 3.7051 3.9278 3.9426 3.8893 4.1691 4.2863 3.8996 3.8961 3.7412 3.5788 1.0255 1.0305 0.9986 1.0010 1.0024 0.9992 1.0167 1.0008 1.0020 0.9954 0.9964 1.0065 1.0154 0.9985 0.9982 1.0020 1.0027 1.0065 1.0076 1.0046 0.9859 0.9451
dispcorr: -0.020100191 hartree
energy: -1071.560979145421
dipole: -31.52067 32.58974 1.06907 -0.94480 -0.95068 -1.89548 -0.80622 0.51805 -0.28817
magnitude: 2.19518 au
magnitude: 5.57970 debye
