program: Gaussian 09
title: 000074803
version: EM64L-G09RevD.01
frameworkgroup: C1[X(C8H10BrNO2S)]
method: RPBEPBE
basis: SDD
operation: Freq
keyword: #p
keyword: freq=noraman
keyword: PBEPBE/SDD
title: #p freq=noraman PBEPBE/SDD
converged: YES YES NO NO
title: Mulliken charges:
elementType: Br S O O N C C C C C C C C H H H H H H H H H H
charge: 0.045255 0.998427 -0.529467 -0.531195 -0.499400 -0.082275 -0.321005 -0.242077 -0.219327 -0.649399 -0.157726 -0.168877 -0.209672 0.303480 0.210031 0.260441 0.293062 0.292580 0.248515 0.208321 0.220847 0.264878 0.264584
chargesum: 0.00000
title: Mulliken charges with hydrogens summed into heavy atoms:
elementType: Br S O O N C C C C C C C C
charge: 0.045255 0.998427 -0.529467 -0.531195 -0.195920 -0.082275 0.149468 0.050985 0.073253 0.028284 0.107152 0.095707 -0.209672
polarizability: 2.10970323e+02 -3.94996498e+00 1.10931379e+02 2.44421019e+00 1.59720736e+01 1.11688441e+02
1716.lowfreq: -7.8860 -1.9003 -0.0017 -0.0015 0.0012 4.8645 26.2569 41.6669 69.2616
frequency: 26.2532 41.6552 69.2544 73.6182 106.9212 124.7526 155.8705 181.5494 226.7221 248.6204 263.5706 277.0300 313.0201 343.4020 367.3352 407.2995 411.0704 419.0337 469.3072 504.9420 610.4449 681.5885 701.2731 723.5766 811.6247 825.2945 834.5847 836.2042 905.5164 954.8373 962.4114 976.5651 979.0006 1042.8077 1048.5176 1053.3801 1103.1407 1107.2840 1128.4667 1176.7404 1252.1577 1281.2761 1323.0916 1361.1608 1372.0904 1374.9123 1391.7744 1444.1451 1467.4282 1477.4448 1493.2155 1560.2894 1587.7137 2930.1595 2988.6116 3054.1016 3083.4852 3109.3801 3151.8806 3155.1639 3175.9481 3178.6834 3429.2337
redmass: 4.2185 3.9017 4.6486 2.1240 5.5923 5.4203 6.1721 20.0430 6.8747 1.3456 3.4359 6.8422 3.6297 9.5679 5.0318 2.8826 2.1787 7.6843 10.9634 3.5647 7.0906 6.9349 3.6303 2.1059 2.8923 1.4807 1.3553 1.3462 1.9495 9.0420 1.3413 1.3964 6.7205 5.6154 3.7832 1.9423 1.3618 1.7912 1.7235 1.1267 1.2012 1.2299 1.1896 1.2621 2.8149 10.7482 1.1993 2.0890 1.0440 1.0402 1.0824 6.0984 8.1758 1.0684 1.0362 1.0927 1.0989 1.1006 1.0898 1.0897 1.0959 1.0971 1.0762
irintensity: 1.0924 0.9515 2.2067 2.3771 2.7818 5.0997 1.5836 0.7325 1.2189 0.7662 8.7451 3.1639 12.1755 30.8086 28.9060 0.9529 63.2971 7.7541 107.3882 95.1435 0.5047 44.4537 4.0690 24.1906 117.5379 55.4052 15.3548 10.8342 3.1938 61.9584 0.6347 0.6430 48.5001 61.8368 4.8280 10.7021 10.1241 25.4404 37.9029 5.0819 8.6317 1.3606 1.2038 1.4897 18.8591 3.0429 10.3937 52.4274 14.8988 7.7723 16.7352 33.2823 0.9467 51.0292 31.7352 1.0806 33.6359 22.3178 2.8498 2.3551 0.8300 3.6556 20.4235
temp: 298.150 k
press: 1.00000 atm
elementType: 35 16 8 8 7 6 6 6 6 6 6 6 6 1 1 1 1 1 1 1 1 1 1
symmnumber: 1
zpe: 437461.4 jmol-1
zpe.correction: 0.166620 hartree
zpe.thermalcorrener: 0.181081 hartree
zpe.thermalcorrenthalpy: 0.182025 hartree
zpe.thermalcorrgfe: 0.122773 hartree
zpe.sumelectzpe: -926.402592 hartree
zpe.sumelectthermal: -926.388131 hartree
zpe.sumelectthermalent: -926.387187 hartree
zpe.sumelectthermalfe: -926.446439 hartree
dipole: -2.4432 4.6529 -2.1826
dipole: 5.6906
quadrupole: -106.0396 -98.8816 -91.4739
quadrupole: 16.9120 -6.2930 4.0079
quadrupole: -7.2412 -0.0832 7.3245 16.9120 -6.2930 4.0079
hfenergy: -926.5692119 hartree
pointgroup: C01 [X(C8H10Br1N1O2S1)]
dipole: 0.8050261 1.8652419 0.940861 debye
dipolederiv: -0.740199 -0.1662004 -0.0490254 -0.2063508 -0.069949 -0.0017751 -0.062146 -0.0023788 -0.0358391 2.0640749 0.0426413 -0.0050222 -0.051185 1.5455952 0.198025 -0.1736394 0.2933729 1.2442533 -0.7247122 -0.0203755 -0.0509092 -0.00379 -0.49661 0.0349118 -0.0744428 -0.0983502 -0.6261771 -0.7077815 -0.0334672 0.0073664 -0.0206588 -0.702747 -0.0115057 0.0384362 0.1521749 -0.4948407 -0.7010504 -0.0988213 0.0589409 0.0324068 -0.7146459 -0.0576449 0.1723019 -0.0863261 -0.3733337 -0.1431821 0.0026166 -0.0050808 0.0594529 -0.2698581 -0.0563172 0.0580959 -0.0984193 -0.1787739 0.1445741 0.1810418 0.0862325 -0.082388 0.4983101 0.0123007 0.2927995 -0.3093298 0.0246108 -0.1526256 0.0900309 -0.0634801 -0.1618357 -0.0533393 -0.0818252 0.2390174 0.0332148 -0.0443356 -0.1596585 -0.0353641 0.1068262 0.1353538 -0.0491835 0.0352158 -0.2278441 -0.0798809 -0.0364981 0.0503732 -0.0169476 0.0192923 0.1532098 -0.0978403 -0.0482747 -0.0760883 0.070314 0.1316964 -0.3915481 -0.178068 0.1215551 -0.1056307 -0.0872865 -0.0127172 -0.0142297 -0.039656 0.0077749 -0.4363489 -0.0007451 -0.155944 -0.1040924 -0.0327596 -0.0804118 -0.0493827 -0.0438822 -0.0152793 1.3505855 0.3692588 0.1230921 0.4074845 0.0393259 -0.0557164 0.1470528 -0.0568266 0.0212848 0.2508786 0.1050858 -0.0738609 0.1200811 0.0551928 -0.0585373 -0.1169232 0.0250416 0.0827513 -0.1333593 -0.1360684 -0.0157293 -0.0344267 -0.1136361 -0.0137629 -0.0668867 0.0158648 0.0610987 0.1105229 -0.0282829 0.0118958 -0.0146441 0.073525 -0.0500264 -0.021984 0.027997 -0.052693 0.1132908 -0.0515499 0.0392511 -0.0166459 0.1093772 0.0536395 0.0103665 0.026792 0.101776 0.0949475 0.0149961 -0.0676576 0.0061473 0.1243727 0.0155453 -0.0311073 0.0382353 0.0897744 -0.0694737 -0.0577801 -0.0227789 -0.1323872 0.0725269 -0.021809 -0.0293324 -0.0295471 0.0847724 0.0703568 0.0130812 -0.0580496 -0.0056729 0.1012277 0.013622 0.0093922 -0.0400749 -0.1606865 0.0490591 0.0491149 0.0311013 0.0894875 -0.1525108 0.0567739 0.0215061 0.0729227 0.0615118 0.0211673 0.0069352 -0.0683024 -0.0032069 0.1239794 0.0543086 -0.0674341 0.0559918 0.0484103 0.0401085 -0.0511321 0.0302866 -0.0607084 0.0969331 0.0759813 0.0224721 0.0727501 0.0587417 unknown
polarizability: 209.6401193|11.2602171|113.0124886|6.4920801|-15.4289482|110.9375345 unknown
InChI: InChI=1S/C8H10BrNO2S/c1-2-10-13(11,12)8-5-3-7(9)4-6-8/h3-6,10H,2H2,1H3
charge 0 multiplicity 1
23 atoms
Br 4.824417 0.800253 0.249736
S  -1.525075 -1.014954 -0.275225
O  -1.917089 -0.853155 -1.842524
O  -1.688801 -2.3856 0.580856
N  -2.561132 0.209233 0.6062
C  0.298503 -0.489605 -0.125328
C  -2.573095 1.589528 0.068924
C  1.040332 -0.973673 0.965108
C  0.839221 0.337171 -1.123726
C  -3.757788 2.348197 0.697273
C  2.395391 -0.587367 1.0755
C  2.194395 0.724065 -1.009572
C  2.948747 0.262752 0.09179
H  -2.401934 0.102714 1.621259
H  -1.622475 2.137627 0.256017
H  -2.716474 1.508034 -1.022952
H  0.584974 -1.658332 1.688329
H  0.232179 0.643414 -1.981874
H  -4.70352 1.825818 0.478255
H  -3.651574 2.431739 1.794707
H  -3.809964 3.371279 0.282833
H  3.006721 -0.949048 1.90664
H  2.65174 1.364109 -1.768827
