program: Orca
programVersion: 5.0.2
elementType: O O O O N N C C C C C C C C C C C C C C C C C H H H H H H H H H H H H H H H H H H H H H H
charge: 0
multiplicity: 1
keywords: wb97x-d3
keywords: def2-TZVPP
keywords: def2/J RIJCOSX
keywords: DEFGRID2
keywords: scfconv7
keywords: smallprint printgap noloewdin
keywords: NOSOSCF
formula: C17H22N2O4
InChI: InChI=1/C17H22N2O4/c1-6-7-18-9-13(20)19(16(18)22)10-23-15(21)14-12(8-11(2)3)17(14,4)5/h1,8,12,14H,7,9-10H2,2-5H3
45 atoms
O  -0.02011 0.317469 -0.27866
O  -1.277326 1.50322 -1.689484
O  1.455999 -2.581236 -1.151071
O  3.210374 1.367518 0.292619
N  2.106617 -0.434472 -0.651593
N  3.779751 -0.818774 0.743982
C  -2.949838 2.016351 0.955317
C  -3.634362 1.027359 0.079353
C  -2.168137 0.819113 0.430138
C  -3.210858 1.993944 2.442135
C  -2.688301 3.402618 0.421834
C  -4.669539 0.08652 0.573317
C  -1.152672 0.938201 -0.625565
C  -5.079967 -1.000534 -0.085669
C  -6.178634 -1.868402 0.446393
C  -4.499027 -1.436235 -1.395711
C  1.028222 0.282469 -1.243287
C  2.203699 -1.802923 -0.611772
C  3.073269 0.171565 0.159431
C  3.417917 -2.113368 0.21814
C  5.050909 -0.581464 1.385605
C  6.167595 -0.606485 0.444436
C  7.090815 -0.630108 -0.323405
H  -3.778163 1.366505 -0.943212
H  -1.952826 0.060328 1.173455
H  -4.11358 2.558656 2.683332
H  -3.333993 0.984248 2.833131
H  -2.380447 2.455118 2.979283
H  -3.523517 4.054021 0.685819
H  -1.786608 3.830965 0.863152
H  -2.584517 3.434282 -0.660435
H  -5.145173 0.325566 1.519801
H  -5.823818 -2.886947 0.622626
H  -6.589945 -1.486386 1.380379
H  -6.996556 -1.948273 -0.274264
H  -3.59195 -0.896133 -1.666641
H  -4.259407 -2.502414 -1.372613
H  -5.223491 -1.301733 -2.204495
H  0.707072 -0.231702 -2.14861
H  1.362428 1.285963 -1.502401
H  3.182918 -2.83039 1.005852
H  4.201962 -2.539939 -0.415648
H  5.199577 -1.341055 2.153565
H  5.014855 0.37689 1.903136
H  7.909456 -0.66039 -1.006875
elementType: O N C H
totalener: -1071.54056417 hartree
nucrepener: 1899.27217140 hartree
electener: -2970.81273557 hartree
oneelecener: -5230.93413621 hartree
twoeener: 2260.12140064 hartree
cpcmener: -0.04858623 hartree
kineticenergy: 1066.86246735 hartree
xcener: -102.622258952612 hartree
chargesum: 0.0000000
charge: -0.278278 -0.499344 -0.470794 -0.510646 -0.136508 -0.166939 0.150716 -0.040910 -0.069306 -0.292735 -0.268918 -0.281186 0.404648 -0.013202 -0.226774 -0.252361 0.088343 0.317828 0.405723 0.002155 -0.041355 -0.434717 0.059711 0.100780 0.093158 0.101467 0.091901 0.099677 0.096704 0.100265 0.090791 0.127269 0.095817 0.089171 0.094736 0.081691 0.095109 0.103464 0.138382 0.134055 0.125105 0.130308 0.142162 0.135043 0.287794
qa: -0.2783 -0.4993 -0.4708 -0.5106 -0.1365 -0.1669 0.1507 -0.0409 -0.0693 -0.2927 -0.2689 -0.2812 0.4046 -0.0132 -0.2268 -0.2524 0.0883 0.3178 0.4057 0.0022 -0.0414 -0.4347 0.0597 0.1008 0.0932 0.1015 0.0919 0.0997 0.0967 0.1003 0.0908 0.1273 0.0958 0.0892 0.0947 0.0817 0.0951 0.1035 0.1384 0.1341 0.1251 0.1303 0.1422 0.1350 0.2878
va: 2.1108 1.9958 2.0396 2.0068 3.1693 3.1934 3.7288 3.8302 3.8248 3.9179 3.8825 3.8828 4.1046 3.7046 3.9277 3.9456 3.8835 4.1654 4.2887 3.8957 3.8991 3.7411 3.5819 1.0247 1.0306 0.9991 1.0009 1.0024 1.0009 0.9996 1.0169 1.0022 0.9964 1.0069 0.9951 1.0130 0.9993 0.9972 0.9997 1.0058 1.0108 1.0030 0.9865 1.0018 0.9450
dispcorr: -0.020114011 hartree
energy: -1071.560678182053
dipole: -31.61869 32.54095 0.92226 1.80517 -3.25559 -1.45041 6.89991 -5.31107 1.58884
magnitude: 2.34066 au
magnitude: 5.94947 debye
